{"text_format":"1","workbook":"xlsx","n_sheets":9,"sheets":["1_共通入力シート【記載必須】","2_個別入力シート（支援プログラム以外）","3_個別入力シート（支援プログラム）","4_総括表への転記シート","個票①（支援プログラム以外）","個票（支援プログラム）","リンク先","自治体CD","補助率判定"],"not_rendered":{"charts":0,"images":0,"macros":1,"external_links":0,"defined_names":46,"comments":1,"pivot_tables":0},"unopened":[],"bounds":{"document_bytes":16777216,"sheet_cells":100000,"rows_first":2000,"rows_last":500,"rows_between":2000,"halvings":0,"cell_chars":16384,"cell_head_chars":4096},"cells_cut":0,"cells_raw":0,"read":"whole","date_system":"1900"}

{"sheet":"1_共通入力シート【記載必須】","index":0,"n_rows":8,"n_cols":36,"rows_kept":8,"cut":false,"hidden":false,"merged":[[0,1,0,15],[9,1,9,5],[1,1,1,5],[3,7,3,10],[3,11,3,14],[3,15,3,18],[2,7,2,26],[2,1,4,1],[2,2,4,2],[2,3,4,3],[2,4,4,4],[2,5,4,5],[2,27,2,35],[2,6,4,6],[1,7,1,26],[1,27,1,35],[3,19,3,22],[3,23,3,26],[3,27,3,29],[3,30,3,32],[3,33,3,35]]}
[null,"共通入力シート\n【地域少子化対策重点推進事業・結婚・妊娠・共育ての相談機会提供・支援プログラム】"]
[null,null,null,null,null,null,"【自治体における少子化対策の全体像】\n※全ての個別事業共通（地域少子化対策重点推進事業・結婚・妊娠・共育ての相談機会提供・支援プログラムいずれも共通）\n※250字以内（2～3段落程度）で要約してください。\n※改行する場合は「Alt + Enter キー」を活用すること。以下に続く全ての欄において同じ。","【自治体における全体ＫＰＩ】\n※全ての個別事業共通（地域少子化対策重点推進事業・結婚・妊娠・共育ての相談機会提供・支援プログラムいずれも共通）\n※少子化対策に関連した各自治体における計画（総合計画、総合戦略、次世代育成計画等）で設定しているKPIの主な項目を最大５つまで記載",null,null,null,null,null,null,null,null,null,null,null,null,null,null,null,null,null,null,null,"【自治体における参考指標】\n※全ての個別事業共通（地域少子化対策重点推進事業・\n結婚・妊娠・共育ての相談機会提供・支援プログラムいずれも共通）\n※項目名は変更しないこと。"]
[null,"自治体コード\n６桁","自治体の区分\n【リスト選択】","都道府県名\n【自動表記】","市町村名\n【自動表記】","都道府県名\n＋\n市町村名\n【自動表記】","自治体における少子化対策の全体像","少子化対策全体の重要業績評価指標(KPI)及び定量的成果目標",null,null,null,null,null,null,null,null,null,null,null,null,null,null,null,null,null,null,null,"参考指標"]
[null,null,null,null,null,null,null,"①",null,null,null,"②",null,null,null,"③",null,null,null,"④",null,null,null,"⑤",null,null,null,"①",null,null,"②",null,null,"③"]
[null,null,null,null,null,null,null,"項目名","単位\n【リスト選択】","目標値（時点）","現状値（時点）","項目名","単位\n【リスト選択】","目標値（時点）","現状値（時点）","項目名","単位\n【リスト選択】","目標値（時点）","現状値（時点）","項目名","単位\n【リスト選択】","目標値（時点）","現状値（時点）","項目名","単位\n【リスト選択】","目標値（時点）","現状値（時点）","項目名","単位","直近の\n実績値(時点)","項目名","単位","直近の\n実績値(時点)","項目名","単位","直近の\n実績値（時点）"]
[null,"vlookup用列番号",{"$f":"COLUMN(C5)-COLUMN($B5)+1","v":2},{"$f":"COLUMN(D5)-COLUMN($B5)+1","v":3},{"$f":"COLUMN(E5)-COLUMN($B5)+1","v":4},{"$f":"COLUMN(F5)-COLUMN($B5)+1","v":5},6,7,8,9,10,11,12,13,14,{"$f":"COLUMN(P5)-COLUMN($B5)+1","v":15},{"$f":"COLUMN(Q5)-COLUMN($B5)+1","v":16},17,18,19,{"$f":"COLUMN(U5)-COLUMN($B5)+1","v":20},21,22,23,24,25,26,27,28,29,30,31,32,33,34,35]
[null,"433641","市町村",{"$f":"IFERROR(VLOOKUP(B7,自治体CD!$A:$B,2,0)&\"\",\"\")","v":"熊本県"},{"$f":"IFERROR(VLOOKUP(B7,自治体CD!$A:$C,3,0)&\"\",\"\")","v":"玉東町"},{"$f":"D7&E7","v":"熊本県玉東町"},"　結婚・妊娠・共育ての相談機会提供・支援プログラムを実施し、結婚に伴う新生活を経済的に支援するため新生活費用に対して補助を行う。\n　また、荒尾・玉名地域結婚サポートセンター（有明広域行政事務組合）と連携して婚活事業を実施し、出会いの場の創出を重点的に行う。事業実施後には、対象者にアンケート調査等を行い、次年度以降により効果的な取組を行えるように留意する。","荒尾・玉名地域結婚サポートセンター新規会員数","人","1\n（R7年度～R11年度）","0\n（R6年度\n1月時点）","不妊治療補助件数","件","5\n（R7年度～R11年度）","3\n（R6.4～R7.2）","子育て関連講座参加者数","人","488\n（R7年度～R11年度）","487\n（R6.4～R7.1）","こども家庭センターにおける相談支援件数","件","60/年\n（R7年度～R11年度）","47/年\n（R6.4～R7.1）",null,null,null,null,"合計特殊出生率",null,"2.44\n（R6年）","婚姻件数","件","22\n（R6年）","婚姻率",null,"4.27\n（R6年）"]
[null,"記載例・留意点等","（留意点）\n市町村事業について、政令指定都市以外（中核市、特別区等）は「市町村」を選択",null,null,null,"（記載例）\n　過年度に引き続き、婚姻件数や婚姻率の低下に歯止めをかけるべく、出会いの場の創出を重点的に行うほか、主に若い世代に対してライフプランセミナーを重点的に行う。その際、EBPMを意識した事業を推進するため、実施後に事業対象者に丁寧にアンケート調査等を行い、次年度以降により効果的な取組を行えるように留意する。\n　また、結婚・妊娠・共育ての相談機会提供・支援プログラムを実施し、経済的不安から結婚に踏み切れない層に対して補助を行う。\n\n（留意点）\n・地域の実情及び課題を踏まえ、自治体が展開する少子化対策の全体像を記載","（記載例）\n公的結婚支援による成婚者数","件","300（R10年度）","100（R6年度）\nor\n数値がない場合は「---」",null,null,null,null,null,null,null,null,null,null,null,null,null,null,null,null,null,null,"1.5（R6年）\nor\n数値がない場合は「---」"]

{"sheet":"2_個別入力シート（支援プログラム以外）","index":1,"n_rows":26,"n_cols":194,"rows_kept":26,"cut":false,"hidden":false,"merged":[[2,48,2,50],[3,48,4,48],[3,49,4,49],[3,50,4,50],[0,1,0,7],[2,167,2,179],[1,167,1,179],[3,168,3,169],[3,170,3,171],[3,172,3,173],[3,174,3,175],[3,178,3,179],[3,167,4,167],[4,168,4,169],[4,170,4,171],[4,172,4,173],[4,174,4,175],[2,15,4,15],[2,24,2,26],[3,24,4,24],[3,25,4,25],[2,1,4,1],[2,2,4,2],[1,8,1,16],[2,3,4,3],[2,4,4,4],[2,82,4,82],[2,58,4,58],[2,68,3,69],[3,34,4,34],[2,70,3,71],[2,72,3,73],[27,1,27,7],[2,5,4,5],[2,6,4,6],[2,7,4,7],[3,20,4,20],[2,21,2,23],[2,8,4,8],[2,9,4,9],[2,10,4,10],[2,11,4,11],[2,12,4,12],[2,13,4,13],[2,14,4,14],[2,16,4,16],[2,17,4,17],[3,21,4,21],[2,30,2,32],[2,33,2,35],[2,36,2,38],[3,27,4,27],[3,28,4,28],[3,29,4,29],[3,30,4,30],[3,31,4,31],[3,32,4,32],[3,33,4,33],[1,62,1,81],[1,18,1,47],[2,60,4,60],[2,61,4,61],[2,54,4,55],[3,26,4,26],[2,27,2,29],[3,38,4,38],[3,39,4,39],[2,39,2,41],[2,42,2,44],[2,45,2,47],[3,40,4,40],[3,41,4,41],[2,51,2,53],[3,45,4,45],[2,18,2,20],[3,18,4,18],[3,19,4,19],[3,36,4,36],[3,37,4,37],[3,22,4,22],[3,23,4,23],[2,56,4,56],[3,136,3,139],[3,140,3,143],[3,144,3,147],[2,74,3,75],[3,35,4,35],[2,76,3,77],[2,78,3,79],[2,57,4,57],[2,59,4,59],[3,47,4,47],[3,42,4,42],[3,43,4,43],[3,44,4,44],[3,51,4,51],[3,52,4,52],[3,53,4,53],[3,46,4,46],[2,62,3,63],[2,80,3,81],[2,103,2,111],[3,109,3,111],[2,64,3,65],[2,66,3,67],[3,128,3,131],[2,112,2,131],[3,116,3,119],[3,124,3,127],[3,120,3,123],[3,132,3,135],[1,83,1,102],[3,83,3,86],[3,87,3,90],[3,91,3,94],[3,95,3,98],[3,99,3,102],[3,103,3,105],[3,106,3,108],[1,112,1,131],[1,103,1,111],[3,180,4,180],[1,132,1,163],[2,83,2,102],[1,180,1,189],[2,180,2,189],[1,164,1,166],[2,164,2,166],[3,164,4,164],[3,165,3,166],[4,178,4,179],[4,181,4,183],[3,181,3,183],[3,184,3,186],[3,187,3,189],[4,184,4,186],[4,187,4,189],[3,176,3,177],[4,176,4,177],[3,148,3,151],[3,156,3,159],[3,160,3,163],[2,132,2,163],[3,112,3,115],[3,152,3,155]]}
[null,"個別入力シート\n【地域少子化対策重点推進事業\n（支援プログラム以外）】"]
[null,null,null,null,null,null,null,null,"※メニューに係るリスト（プルダウン）については、選択内容によって分岐して表示されるように設定されているため、左から順番に選択すること。\n※これらの欄は、「4_総括表への転記シート」に自動転記",null,null,null,null,null,null,null,null,null,"【費用内訳】\n※マクロの実行による自動転記ができない場合、これらの欄は、次のいずれかを必ず「値で貼り付け」すること！\n　・「積算内訳書」のAR列～BU列\n　・「結婚支援センターの運営費内訳」のBC列～CF列",null,null,null,null,null,null,null,null,null,null,null,null,null,null,null,null,null,null,null,null,null,null,null,null,null,null,null,null,null,null,null,null,null,null,null,null,null,null,null,null,null,null,null,"※個別事業の内容の「項目」は150字以内・「内容」は1000字以内で要約すること。\n※１つの個票について最大10項目までとし、４項目以降は非表示された列を再表示すること。",null,null,null,null,null,null,null,null,null,null,null,null,null,null,null,null,null,null,null,null,"【自治体における全体ＫＰＩ】\n※全ての個別事業共通（地域少子化対策重点推進事業・結婚・妊娠・共育ての相談機会提供・支援プログラムいずれも共通）\n※少子化対策に関連した各自治体における計画（総合計画、総合戦略、次世代育成計画等）で設定しているKPI主な項目を最大５つまで記載",null,null,null,null,null,null,null,null,null,null,null,null,null,null,null,null,null,null,null,"【自治体における参考指標】\n※全ての個別事業共通（地域少子化対策重点推進事業・\n結婚・妊娠・共育ての相談機会提供・支援プログラムいずれも共通）\n※項目名は変更しないこと。",null,null,null,null,null,null,null,null,"【個別事業における個別ＫＰＩ（アウトプット）】\n※主な項目を最大５つまで記載\n※申請手順に定めるKPI設定例を参照の上設定すること。（◎の指標は必ず設定）\n※目標値は事業実施年度末時点のものを設定すること。",null,null,null,null,null,null,null,null,null,null,null,null,null,null,null,null,null,null,null,"【個別事業における個別ＫＰＩ（アウトカム）】\n※項目名①～③は、個別事業の性質を踏まえ、事業対象者から当該項目のアンケートをとることができる場合は必須（該当しない場合は「---」と入力）\n※項目名④以下に主な項目を最大５つまで記載\n※申請手順に定めるKPI設定例を参照の上、設定すること。（◎の指標は必ず設定）\n※目標値は事業実施年度末時点のものを設定すること。",null,null,null,null,null,null,null,null,null,null,null,null,null,null,null,null,null,null,null,null,null,null,null,null,null,null,null,null,null,null,null,"【予算時期調査】\n※市町村事業を実施する場合、実施主体の市町村において予算が措置されていることに加え、都道府県においても対応する予算が措置されていることが必要です。",null,null,"【共通の要件確認欄（※対象経費部分）】\n※「ＯＫ」となっているか必ず確認",null,null,null,null,null,null,null,null,null,null,null,null,"【重点メニュー・結婚支援コンシェルジュ事業の要件確認欄】\n※「ＯＫ」となっているか必ず確認"]
[null,"個票番号","自治体コード\n６桁","自治体の区分\n【リスト選択】","都道府県名\n【リスト選択】","市町村名","都道府県名\n＋\n市町村名\n【自動表記】","本事業の担当部局名","国予算区分\n【リスト選択】","事業メニュー\n【リスト選択】","区分\n【リスト選択】","関連事業メニュー\n【リスト選択】","個別事業名","国補助率\n【自動表記】","Ａ\n総事業費（円）\n【自動表記】","Ｂ\n寄付金その他の収入予定額（円）","Ｃ\n対象経費支出予定額（円）\n※国補助率を乗じる前の額\n【自動表記】","A-Ｂ\n差引額（円）\n【自動表記】","諸謝金（円）",null,null,"賃金（円）",null,null,"報償費（円）",null,null,"旅費（円）",null,null,"需用費（円）",null,null,"役務費（円）",null,null,"委託料（円）",null,null,"使用料及び賃借料（円）",null,null,"負担金（円）",null,null,"補助金（円）",null,null,null,null,null,"合計（円）",null,null,"実施期間（和暦）\n※始期については原則として\n4/1とすること。\nなお、年度途中の変更決定を受けてから開始する場合は「交付決定日」とすること。\n※終期については原則として\n3/31とすること。",null,"新規／継続\n(一般財源での\n実施も含む)\n【リスト選択】","事業開始\n年度（西暦）\n※新規の場合は「2026」と入力","事業開始\n年度（和暦）\n【自動表記】","経過年度\n【自動表記】","自治体における少子化対策の全体像\n※全ての個別事業共通（地域少子化対策重点推進事業・結婚・妊娠・共育ての相談機会提供・支援プログラムいずれも共通）\n※250字以内（2～3段落程度）で要約してください。","自治体における少子化対策の全体像の中での本個別事業の位置付け\n※250字以内（2～3段落程度）で要約してください。","個別事業の内容１",null,"個別事業の内容２",null,"個別事業の内容３",null,"個別事業の内容４",null,"個別事業の内容５",null,"個別事業の内容６",null,"個別事業の内容７",null,"個別事業の内容８",null,"個別事業の内容９",null,"個別事業の内容１０",null,"過年度の本個別事業で浮かび上がった課題の分析及びそれに対する取組（ステップアップを含む。）\n※箇条書きで簡潔に記載してください。","少子化対策全体の重要業績評価指標(KPI)及び定量的成果目標",null,null,null,null,null,null,null,null,null,null,null,null,null,null,null,null,null,null,null,"参考指標",null,null,null,null,null,null,null,null,"個別事業の重要業績評価指標(KPI)及び定量的成果目標【アウトプット】",null,null,null,null,null,null,null,null,null,null,null,null,null,null,null,null,null,null,null,"個別事業の重要業績評価指標(KPI)及び定量的成果目標【アウトカム】",null,null,null,null,null,null,null,null,null,null,null,null,null,null,null,null,null,null,null,null,null,null,null,null,null,null,null,null,null,null,null,"【全事業記入】 ",null,null,"【全事業記入】 ",null,null,null,null,null,null,null,null,null,null,null,null,"【重点メニュー・結婚支援コンシェルジュ事業の場合のみ記入】 "]
[null,null,null,null,null,null,null,null,null,null,null,null,null,null,null,null,null,null,"総事業費","対象経費\n支出予定額\n【自動表記】","対象外経費\n支出予定額","総事業費","対象経費\n支出予定額\n【自動表記】","対象外経費\n支出予定額","総事業費","対象経費\n支出予定額\n【自動表記】","対象外経費\n支出予定額","総事業費","対象経費\n支出予定額\n【自動表記】","対象外経費\n支出予定額","総事業費","対象経費\n支出予定額\n【自動表記】","対象外経費\n支出予定額","総事業費","対象経費\n支出予定額\n【自動表記】","対象外経費\n支出予定額","総事業費","対象経費\n支出予定額\n【自動表記】","対象外経費\n支出予定額","総事業費","対象経費\n支出予定額\n【自動表記】","対象外経費\n支出予定額","総事業費","対象経費\n支出予定額\n【自動表記】","対象外経費\n支出予定額","総事業費","対象経費\n支出予定額\n【自動表記】","対象外経費\n支出予定額",null,null,null,"総事業費\n【自動表記】","対象経費\n支出予定額\n【自動表記】","対象外経費\n支出予定額\n【自動表記】",null,null,null,null,null,null,null,null,null,null,null,null,null,null,null,null,null,null,null,null,null,null,null,null,null,null,null,null,null,"①",null,null,null,"②",null,null,null,"③",null,null,null,"④",null,null,null,"⑤",null,null,null,"①",null,null,"②",null,null,"③",null,null,"①",null,null,null,"②",null,null,null,"③",null,null,null,"④",null,null,null,"⑤",null,null,null,"①",null,null,null,"②",null,null,null,"③",null,null,null,"④",null,null,null,"⑤",null,null,null,"⑥",null,null,null,"⑦",null,null,null,"⑧",null,null,null,"実施自治体の\n予算議決(予定)日","年度途中の交付決定を\n希望する場合のみ記載",null,"共通要件の\n充足チェック結果","共通要件①",null,"共通要件②",null,"共通要件③",null,"共通要件④",null,"共通要件⑤",null,"共通要件⑥",null,"重点メニュー等要件の\n充足チェック結果","重点メニュー等要件①",null,null,"重点メニュー要件等②",null,null,"重点メニュー等要件③"]
[null,null,null,null,null,null,null,null,null,null,null,null,null,null,null,null,null,null,null,null,null,null,null,null,null,null,null,null,null,null,null,null,null,null,null,null,null,null,null,null,null,null,null,null,null,null,null,null,null,null,null,null,null,null,null,null,null,null,null,null,null,null,"項目","内容","項目","内容","項目","内容","項目","内容","項目","内容","項目","内容","項目","内容","項目","内容","項目","内容","項目","内容",null,"項目名","単位\n【リスト選択】","目標値（時点）","現状値（時点）","項目名","単位\n【リスト選択】","目標値（時点）","現状値（時点）","項目名","単位\n【リスト選択】","目標値（時点）","現状値（時点）","項目名","単位\n【リスト選択】","目標値（時点）","現状値（時点）","項目名","単位\n【リスト選択】","目標値（時点）","現状値（時点）","項目名","単位","直近の\n実績値(時点)","項目名","単位","直近の\n実績値(時点)","項目名","単位","直近の\n実績値（時点）","項目名","単位\n【リスト選択】","目標値（時点）","現状値（時点）","項目名","単位\n【リスト選択】","目標値（時点）","現状値（時点）","項目名","単位\n【リスト選択】","目標値（時点）","現状値（時点）","項目名","単位\n【リスト選択】","目標値（時点）","現状値（時点）","項目名","単位\n【リスト選択】","目標値（時点）","現状値（時点）","項目名","単位","目標値（時点）","現状値（時点）","項目名","単位","目標値（時点）","現状値（時点）","項目名","単位","目標値（時点）","現状値（時点）","項目名","単位\n【リスト選択】","目標値（時点）","現状値（時点）","項目名","単位\n【リスト選択】","目標値（時点）","現状値（時点）","項目名","単位\n【リスト選択】","目標値（時点）","現状値（時点）","項目名","単位\n【リスト選択】","目標値（時点）","現状値（時点）","項目名","単位\n【リスト選択】","目標値（時点）","現状値（時点）",null,"国からの\n交付決定希望日\n※7月～3月中旬(10日～20日)を目安とすること。","備考",null,{"$f":"リンク先!F146","v":"＜人件費＞\n職員の人件費（次に掲げるものを除く。）が含まれていないか。\n・事業に伴う会計年度任用職員のもの\n・結婚支援センターのもの\n\n【リスト選択】"},null,{"$f":"リンク先!G146","v":"＜備品購入＞\n備品購入に要する経費が含まれていないか。\n\n【リスト選択】"},null,{"$f":"リンク先!H146","v":"＜施設整備＞\n施設整備に要する経費が含まれていないか。\n\n【リスト選択】"},null,{"$f":"リンク先!I146","v":"＜個人給付①＞\n個人への金銭給付などによる個人の負担を直接的に軽減する事業に要する経費（次に掲げるものを除く。）が含まれていないか。\n・結婚支援センター及び結婚支援事業者の登録優待費用\n\n【リスト選択】"},null,{"$f":"リンク先!J146","v":"＜個人給付②＞\n結婚支援センター及び結婚支援事業者の登録優待費用が含まれていないか。\n\n【リスト選択】"},null,{"$f":"リンク先!K146","v":"＜他の国庫負担金等＞\n他の国庫負担金、補助金又は交付金の交付の対象となる事業に要する経費が含まれていないか。\n\n【リスト選択】"},null,null,"下記の要件を満たす場合は「○」を選択",null,null,"下記の要件を満たす場合は「○」を選択",null,null,"下記の要件を満たす場合は「○」を選択"]
[null,"vlookup用列番号",{"$f":"COLUMN(C5)-COLUMN($B5)+1","v":2},{"$f":"COLUMN(D5)-COLUMN($B5)+1","v":3},{"$f":"COLUMN(E5)-COLUMN($B5)+1","v":4},{"$f":"COLUMN(F5)-COLUMN($B5)+1","v":5},6,7,8,9,10,11,12,13,14,15,16,{"$f":"COLUMN(R5)-COLUMN($B5)+1","v":17},18,19,20,{"$f":"COLUMN(V5)-COLUMN($B5)+1","v":21},22,23,24,25,26,{"$f":"COLUMN(AB5)-COLUMN($B5)+1","v":27},28,29,30,31,32,33,34,35,{"$f":"COLUMN(AK5)-COLUMN($B5)+1","v":36},37,38,39,40,41,42,43,44,45,46,47,null,null,null,{"$f":"COLUMN(AZ5)-COLUMN($B5)+1","v":51},52,53,{"$f":"COLUMN(BC5)-COLUMN($B5)+1","v":54},{"$f":"COLUMN(BD5)-COLUMN($B5)+1","v":55},56,57,58,{"$f":"COLUMN(BH5)-COLUMN($B5)+1","v":59},60,61,62,63,{"$f":"COLUMN(BM5)-COLUMN($B5)+1","v":64},65,{"$f":"COLUMN(BO5)-COLUMN($B5)+1","v":66},67,68,69,70,71,{"$f":"COLUMN(BU5)-COLUMN($B5)+1","v":72},73,74,75,76,77,78,79,80,81,{"$f":"COLUMN(CE5)-COLUMN($B5)+1","v":82},83,84,85,86,87,88,89,90,91,92,93,94,95,96,97,98,{"$f":"COLUMN(CV5)-COLUMN($B5)+1","v":99},100,101,102,103,104,105,106,107,108,109,110,111,112,113,114,115,116,117,118,119,{"$f":"COLUMN(DQ5)-COLUMN($B5)+1","v":120},121,122,123,{"$f":"COLUMN(DU5)-COLUMN($B5)+1","v":124},125,126,127,{"$f":"COLUMN(DY5)-COLUMN($B5)+1","v":128},129,130,131,132,133,134,135,136,137,138,139,140,141,142,143,144,145,146,147,{"$f":"COLUMN(ES5)-COLUMN($B5)+1","v":148},149,150,151,152,153,154,155,156,157,158,159,160,161,162,163,{"$f":"COLUMN(FI5)-COLUMN($B5)+1","v":164},165,166,167,{"$f":"COLUMN(FM5)-COLUMN($B5)+1","v":168},169,{"$f":"COLUMN(FO5)-COLUMN($B5)+1","v":170},171,{"$f":"COLUMN(FQ5)-COLUMN($B5)+1","v":172},173,174,175,{"$f":"COLUMN(FU5)-COLUMN($B5)+1","v":176},177,178,{"$f":"COLUMN(FX5)-COLUMN($B5)+1","v":179},{"$f":"COLUMN(FY5)-COLUMN($B5)+1","v":180},181,182,183,184,{"$f":"COLUMN(GD5)-COLUMN($B5)+1","v":185},186,{"$f":"COLUMN(GF5)-COLUMN($B5)+1","v":187},188,{"$f":"COLUMN(GH5)-COLUMN($B5)+1","v":189},null,null,"補助率検索用キー","補助率判定"]
[null,"①",{"$f":"'1_共通入力シート【記載必須】'!$B$7","v":"433641"},{"$f":"'1_共通入力シート【記載必須】'!$C$7","v":"市町村"},{"$f":"'1_共通入力シート【記載必須】'!$D$7","v":"熊本県"},{"$f":"'1_共通入力シート【記載必須】'!$E$7","v":"玉東町"},{"$f":"'1_共通入力シート【記載必須】'!$F$7","v":"熊本県玉東町"},null,null,null,null,null,null,{"$f":"IFERROR(VLOOKUP(GK7,リンク先!$F$3:$J$9,1+GL7,0),\"\")","v":""},{"$f":"AZ7","v":0},null,{"$f":"BA7","v":0},{"$f":"O7-P7","v":0},null,{"$f":"S7-U7","v":0},null,null,{"$f":"V7-X7","v":0},null,null,{"$f":"Y7-AA7","v":0},null,null,{"$f":"AB7-AD7","v":0},null,null,{"$f":"AE7-AG7","v":0},null,null,{"$f":"AH7-AJ7","v":0},null,null,{"$f":"AK7-AM7","v":0},null,null,{"$f":"AN7-AP7","v":0},null,null,{"$f":"AQ7-AS7","v":0},null,null,{"$f":"AT7-AV7","v":0},null,null,null,null,{"$f":"S7+V7+Y7+AB7+AE7+AH7+AK7+AN7+AQ7+AT7","v":0},{"$f":"T7+W7+Z7+AC7+AF7+AI7+AL7+AO7+AR7+AU7","v":0},{"$f":"U7+X7+AA7+AD7+AG7+AJ7+AM7+AP7+AS7+AV7","v":0},null,null,null,null,{"$f":"DATEVALUE(BF7&\"年12月31日\")","v":{"$error":"#VALUE!"}},{"$f":"2026-BF7","v":2026},{"$f":"'1_共通入力シート【記載必須】'!$G$7","v":"　結婚・妊娠・共育ての相談機会提供・支援プログラムを実施し、結婚に伴う新生活を経済的に支援するため新生活費用に対して補助を行う。\n　また、荒尾・玉名地域結婚サポートセンター（有明広域行政事務組合）と連携して婚活事業を実施し、出会いの場の創出を重点的に行う。事業実施後には、対象者にアンケート調査等を行い、次年度以降により効果的な取組を行えるように留意する。"},null,null,null,null,null,null,null,null,null,null,null,null,null,null,null,null,null,null,null,null,null,null,{"$f":"IF('1_共通入力シート【記載必須】'!H$7=\"\",\"\",'1_共通入力シート【記載必須】'!H$7)","v":"荒尾・玉名地域結婚サポートセンター新規会員数"},{"$f":"IF('1_共通入力シート【記載必須】'!I$7=\"\",\"\",'1_共通入力シート【記載必須】'!I$7)","v":"人"},{"$f":"IF('1_共通入力シート【記載必須】'!J$7=\"\",\"\",'1_共通入力シート【記載必須】'!J$7)","v":"1\n（R7年度～R11年度）"},{"$f":"IF('1_共通入力シート【記載必須】'!K$7=\"\",\"\",'1_共通入力シート【記載必須】'!K$7)","v":"0\n（R6年度\n1月時点）"},{"$f":"IF('1_共通入力シート【記載必須】'!L$7=\"\",\"\",'1_共通入力シート【記載必須】'!L$7)","v":"不妊治療補助件数"},{"$f":"IF('1_共通入力シート【記載必須】'!M$7=\"\",\"\",'1_共通入力シート【記載必須】'!M$7)","v":"件"},{"$f":"IF('1_共通入力シート【記載必須】'!N$7=\"\",\"\",'1_共通入力シート【記載必須】'!N$7)","v":"5\n（R7年度～R11年度）"},{"$f":"IF('1_共通入力シート【記載必須】'!O$7=\"\",\"\",'1_共通入力シート【記載必須】'!O$7)","v":"3\n（R6.4～R7.2）"},{"$f":"IF('1_共通入力シート【記載必須】'!P$7=\"\",\"\",'1_共通入力シート【記載必須】'!P$7)","v":"子育て関連講座参加者数"},{"$f":"IF('1_共通入力シート【記載必須】'!Q$7=\"\",\"\",'1_共通入力シート【記載必須】'!Q$7)","v":"人"},{"$f":"IF('1_共通入力シート【記載必須】'!R$7=\"\",\"\",'1_共通入力シート【記載必須】'!R$7)","v":"488\n（R7年度～R11年度）"},{"$f":"IF('1_共通入力シート【記載必須】'!S$7=\"\",\"\",'1_共通入力シート【記載必須】'!S$7)","v":"487\n（R6.4～R7.1）"},{"$f":"IF('1_共通入力シート【記載必須】'!T$7=\"\",\"\",'1_共通入力シート【記載必須】'!T$7)","v":"こども家庭センターにおける相談支援件数"},{"$f":"IF('1_共通入力シート【記載必須】'!U$7=\"\",\"\",'1_共通入力シート【記載必須】'!U$7)","v":"件"},{"$f":"IF('1_共通入力シート【記載必須】'!V$7=\"\",\"\",'1_共通入力シート【記載必須】'!V$7)","v":"60/年\n（R7年度～R11年度）"},{"$f":"IF('1_共通入力シート【記載必須】'!W$7=\"\",\"\",'1_共通入力シート【記載必須】'!W$7)","v":"47/年\n（R6.4～R7.1）"},{"$f":"IF('1_共通入力シート【記載必須】'!X$7=\"\",\"\",'1_共通入力シート【記載必須】'!X$7)","v":""},{"$f":"IF('1_共通入力シート【記載必須】'!Y$7=\"\",\"\",'1_共通入力シート【記載必須】'!Y$7)","v":""},{"$f":"IF('1_共通入力シート【記載必須】'!Z$7=\"\",\"\",'1_共通入力シート【記載必須】'!Z$7)","v":""},{"$f":"IF('1_共通入力シート【記載必須】'!AA$7=\"\",\"\",'1_共通入力シート【記載必須】'!AA$7)","v":""},{"$f":"IF('1_共通入力シート【記載必須】'!AB$7=\"\",\"\",'1_共通入力シート【記載必須】'!AB$7)","v":"合計特殊出生率"},{"$f":"IF('1_共通入力シート【記載必須】'!AC$7=\"\",\"\",'1_共通入力シート【記載必須】'!AC$7)","v":""},{"$f":"IF('1_共通入力シート【記載必須】'!AD$7=\"\",\"\",'1_共通入力シート【記載必須】'!AD$7)","v":"2.44\n（R6年）"},{"$f":"IF('1_共通入力シート【記載必須】'!AE$7=\"\",\"\",'1_共通入力シート【記載必須】'!AE$7)","v":"婚姻件数"},{"$f":"IF('1_共通入力シート【記載必須】'!AF$7=\"\",\"\",'1_共通入力シート【記載必須】'!AF$7)","v":"件"},{"$f":"IF('1_共通入力シート【記載必須】'!AG$7=\"\",\"\",'1_共通入力シート【記載必須】'!AG$7)","v":"22\n（R6年）"},{"$f":"IF('1_共通入力シート【記載必須】'!AH$7=\"\",\"\",'1_共通入力シート【記載必須】'!AH$7)","v":"婚姻率"},{"$f":"IF('1_共通入力シート【記載必須】'!AI$7=\"\",\"\",'1_共通入力シート【記載必須】'!AI$7)","v":""},{"$f":"IF('1_共通入力シート【記載必須】'!AJ$7=\"\",\"\",'1_共通入力シート【記載必須】'!AJ$7)","v":"4.27\n（R6年）"},null,null,null,null,null,null,null,null,null,null,null,null,null,null,null,null,null,null,null,null,"交付金事業に対する事業対象者（住民等）の満足度\n\n※該当事業のみ必須","％",null,null,"希望どおりの結婚に向けて後押ししてくれたと感じた人の割合\n\n※該当事業のみ必須","％",null,null,"結婚、妊娠・出産、子育てに前向きになったと感じた人の割合\n\n※該当事業のみ必須","％",null,null,null,null,null,null,null,null,null,null,null,null,null,null,null,null,null,null,null,null,null,null,null,null,null,{"$f":"IF(OR(FN7=\"NG\",FP7=\"NG\",FR7=\"NG\",FT7=\"NG\",FV7=\"NG\",FX7=\"NG\"),\"NG\",\"OK\")","v":"NG"},null,{"$f":"IF(FM7=\"含まれていない\",\"OK\",\"NG\")","v":"NG"},null,{"$f":"IF(FO7=\"含まれていない\",\"OK\",\"NG\")","v":"NG"},null,{"$f":"IF(FQ7=\"含まれていない\",\"OK\",\"NG\")","v":"NG"},null,{"$f":"IF(FS7=\"含まれていない\",\"OK\",\"NG\")","v":"NG"},null,{"$f":"IF(OR(FU7=\"含まれている（留意点等の要件ア〜エを満たしている）\",FU7=\"含まれていない\"),\"OK\",\"NG\")","v":"NG"},null,{"$f":"IF(FW7=\"含まれていない\",\"OK\",\"NG\")","v":"NG"},{"$f":"IF(OR(GB7=\"NG\",GE7=\"NG\",GH7=\"NG\"),\"NG\",\"OK\")","v":"OK"},{"$f":"IFERROR(VLOOKUP($L7,リンク先!$E$147:$M$157,2,FALSE)&\"\",\"\")","v":""},null,{"$f":"IF(OR(GA7=\"○\",FZ7=\"\"),\"OK\",\"NG\")","v":"OK"},{"$f":"IFERROR(VLOOKUP($L7,リンク先!$E$147:$M$157,3,FALSE)&\"\",\"\")","v":""},null,{"$f":"IF(OR(GD7=\"○\",GC7=\"\"),\"OK\",\"NG\")","v":"OK"},{"$f":"IFERROR(VLOOKUP($L7,リンク先!$E$147:$M$157,4,FALSE)&\"\",\"\")","v":""},null,{"$f":"IF(OR(GG7=\"○\",GF7=\"\"),\"OK\",\"NG\")","v":"OK"},null,null,{"$f":"J7&K7","v":""},{"$f":"IF(I7=リンク先!$C$12,4,VLOOKUP('1_共通入力シート【記載必須】'!$B$7,補助率判定!$B:$I,8,0))","v":2}]
[null,"②",{"$f":"'1_共通入力シート【記載必須】'!$B$7","v":"433641"},{"$f":"'1_共通入力シート【記載必須】'!$C$7","v":"市町村"},{"$f":"'1_共通入力シート【記載必須】'!$D$7","v":"熊本県"},{"$f":"'1_共通入力シート【記載必須】'!$E$7","v":"玉東町"},{"$f":"'1_共通入力シート【記載必須】'!$F$7","v":"熊本県玉東町"},null,null,null,null,null,null,{"$f":"IFERROR(VLOOKUP(GK8,リンク先!$F$3:$J$9,1+GL8,0),\"\")","v":""},0,null,0,{"$f":"O8-P8","v":0},null,0,null,null,0,null,null,0,null,null,0,null,null,0,null,null,0,null,null,0,null,null,0,null,null,0,null,null,0,null,null,null,null,{"$f":"S8+V8+Y8+AB8+AE8+AH8+AK8+AN8+AQ8+AT8","v":0},{"$f":"T8+W8+Z8+AC8+AF8+AI8+AL8+AO8+AR8+AU8","v":0},{"$f":"U8+X8+AA8+AD8+AG8+AJ8+AM8+AP8+AS8+AV8","v":0},null,null,null,null,{"$f":"DATEVALUE(BF8&\"年12月31日\")","v":{"$error":"#VALUE!"}},{"$f":"2026-BF8","v":2026},{"$f":"'1_共通入力シート【記載必須】'!$G$7","v":"　結婚・妊娠・共育ての相談機会提供・支援プログラムを実施し、結婚に伴う新生活を経済的に支援するため新生活費用に対して補助を行う。\n　また、荒尾・玉名地域結婚サポートセンター（有明広域行政事務組合）と連携して婚活事業を実施し、出会いの場の創出を重点的に行う。事業実施後には、対象者にアンケート調査等を行い、次年度以降により効果的な取組を行えるように留意する。"},null,null,null,null,null,null,null,null,null,null,null,null,null,null,null,null,null,null,null,null,null,null,{"$f":"IF('1_共通入力シート【記載必須】'!H$7=\"\",\"\",'1_共通入力シート【記載必須】'!H$7)","v":"荒尾・玉名地域結婚サポートセンター新規会員数"},{"$f":"IF('1_共通入力シート【記載必須】'!I$7=\"\",\"\",'1_共通入力シート【記載必須】'!I$7)","v":"人"},{"$f":"IF('1_共通入力シート【記載必須】'!J$7=\"\",\"\",'1_共通入力シート【記載必須】'!J$7)","v":"1\n（R7年度～R11年度）"},{"$f":"IF('1_共通入力シート【記載必須】'!K$7=\"\",\"\",'1_共通入力シート【記載必須】'!K$7)","v":"0\n（R6年度\n1月時点）"},{"$f":"IF('1_共通入力シート【記載必須】'!L$7=\"\",\"\",'1_共通入力シート【記載必須】'!L$7)","v":"不妊治療補助件数"},{"$f":"IF('1_共通入力シート【記載必須】'!M$7=\"\",\"\",'1_共通入力シート【記載必須】'!M$7)","v":"件"},{"$f":"IF('1_共通入力シート【記載必須】'!N$7=\"\",\"\",'1_共通入力シート【記載必須】'!N$7)","v":"5\n（R7年度～R11年度）"},{"$f":"IF('1_共通入力シート【記載必須】'!O$7=\"\",\"\",'1_共通入力シート【記載必須】'!O$7)","v":"3\n（R6.4～R7.2）"},{"$f":"IF('1_共通入力シート【記載必須】'!P$7=\"\",\"\",'1_共通入力シート【記載必須】'!P$7)","v":"子育て関連講座参加者数"},{"$f":"IF('1_共通入力シート【記載必須】'!Q$7=\"\",\"\",'1_共通入力シート【記載必須】'!Q$7)","v":"人"},{"$f":"IF('1_共通入力シート【記載必須】'!R$7=\"\",\"\",'1_共通入力シート【記載必須】'!R$7)","v":"488\n（R7年度～R11年度）"},{"$f":"IF('1_共通入力シート【記載必須】'!S$7=\"\",\"\",'1_共通入力シート【記載必須】'!S$7)","v":"487\n（R6.4～R7.1）"},{"$f":"IF('1_共通入力シート【記載必須】'!T$7=\"\",\"\",'1_共通入力シート【記載必須】'!T$7)","v":"こども家庭センターにおける相談支援件数"},{"$f":"IF('1_共通入力シート【記載必須】'!U$7=\"\",\"\",'1_共通入力シート【記載必須】'!U$7)","v":"件"},{"$f":"IF('1_共通入力シート【記載必須】'!V$7=\"\",\"\",'1_共通入力シート【記載必須】'!V$7)","v":"60/年\n（R7年度～R11年度）"},{"$f":"IF('1_共通入力シート【記載必須】'!W$7=\"\",\"\",'1_共通入力シート【記載必須】'!W$7)","v":"47/年\n（R6.4～R7.1）"},{"$f":"IF('1_共通入力シート【記載必須】'!X$7=\"\",\"\",'1_共通入力シート【記載必須】'!X$7)","v":""},{"$f":"IF('1_共通入力シート【記載必須】'!Y$7=\"\",\"\",'1_共通入力シート【記載必須】'!Y$7)","v":""},{"$f":"IF('1_共通入力シート【記載必須】'!Z$7=\"\",\"\",'1_共通入力シート【記載必須】'!Z$7)","v":""},{"$f":"IF('1_共通入力シート【記載必須】'!AA$7=\"\",\"\",'1_共通入力シート【記載必須】'!AA$7)","v":""},{"$f":"IF('1_共通入力シート【記載必須】'!AB$7=\"\",\"\",'1_共通入力シート【記載必須】'!AB$7)","v":"合計特殊出生率"},{"$f":"IF('1_共通入力シート【記載必須】'!AC$7=\"\",\"\",'1_共通入力シート【記載必須】'!AC$7)","v":""},{"$f":"IF('1_共通入力シート【記載必須】'!AD$7=\"\",\"\",'1_共通入力シート【記載必須】'!AD$7)","v":"2.44\n（R6年）"},{"$f":"IF('1_共通入力シート【記載必須】'!AE$7=\"\",\"\",'1_共通入力シート【記載必須】'!AE$7)","v":"婚姻件数"},{"$f":"IF('1_共通入力シート【記載必須】'!AF$7=\"\",\"\",'1_共通入力シート【記載必須】'!AF$7)","v":"件"},{"$f":"IF('1_共通入力シート【記載必須】'!AG$7=\"\",\"\",'1_共通入力シート【記載必須】'!AG$7)","v":"22\n（R6年）"},{"$f":"IF('1_共通入力シート【記載必須】'!AH$7=\"\",\"\",'1_共通入力シート【記載必須】'!AH$7)","v":"婚姻率"},{"$f":"IF('1_共通入力シート【記載必須】'!AI$7=\"\",\"\",'1_共通入力シート【記載必須】'!AI$7)","v":""},{"$f":"IF('1_共通入力シート【記載必須】'!AJ$7=\"\",\"\",'1_共通入力シート【記載必須】'!AJ$7)","v":"4.27\n（R6年）"},null,null,null,null,null,null,null,null,null,null,null,null,null,null,null,null,null,null,null,null,"交付金事業に対する事業対象者（住民等）の満足度\n\n※該当事業のみ必須","％",null,null,"希望どおりの結婚に向けて後押ししてくれたと感じた人の割合\n\n※該当事業のみ必須","％",null,null,"結婚、妊娠・出産、子育てに前向きになったと感じた人の割合\n\n※該当事業のみ必須","％",null,null,null,null,null,null,null,null,null,null,null,null,null,null,null,null,null,null,null,null,null,null,null,null,null,{"$f":"IF(OR(FN8=\"NG\",FP8=\"NG\",FR8=\"NG\",FT8=\"NG\",FV8=\"NG\",FX8=\"NG\"),\"NG\",\"OK\")","v":"NG"},null,{"$f":"IF(FM8=\"含まれていない\",\"OK\",\"NG\")","v":"NG"},null,{"$f":"IF(FO8=\"含まれていない\",\"OK\",\"NG\")","v":"NG"},null,{"$f":"IF(FQ8=\"含まれていない\",\"OK\",\"NG\")","v":"NG"},null,{"$f":"IF(FS8=\"含まれていない\",\"OK\",\"NG\")","v":"NG"},null,{"$f":"IF(OR(FU8=\"含まれている（留意点等の要件ア〜エを満たしている）\",FU8=\"含まれていない\"),\"OK\",\"NG\")","v":"NG"},null,{"$f":"IF(FW8=\"含まれていない\",\"OK\",\"NG\")","v":"NG"},{"$f":"IF(OR(GB8=\"NG\",GE8=\"NG\",GH8=\"NG\"),\"NG\",\"OK\")","v":"OK"},{"$f":"IFERROR(VLOOKUP($L8,リンク先!$E$147:$M$157,2,FALSE)&\"\",\"\")","v":""},null,{"$f":"IF(OR(GA8=\"○\",FZ8=\"\"),\"OK\",\"NG\")","v":"OK"},{"$f":"IFERROR(VLOOKUP($L8,リンク先!$E$147:$M$157,3,FALSE)&\"\",\"\")","v":""},null,{"$f":"IF(OR(GD8=\"○\",GC8=\"\"),\"OK\",\"NG\")","v":"OK"},{"$f":"IFERROR(VLOOKUP($L8,リンク先!$E$147:$M$157,4,FALSE)&\"\",\"\")","v":""},null,{"$f":"IF(OR(GG8=\"○\",GF8=\"\"),\"OK\",\"NG\")","v":"OK"},null,null,"",{"$f":"IF(I8=リンク先!$C$12,4,VLOOKUP('1_共通入力シート【記載必須】'!$B$7,補助率判定!$B:$I,8,0))","v":2}]
[null,"③",{"$f":"'1_共通入力シート【記載必須】'!$B$7","v":"433641"},{"$f":"'1_共通入力シート【記載必須】'!$C$7","v":"市町村"},{"$f":"'1_共通入力シート【記載必須】'!$D$7","v":"熊本県"},{"$f":"'1_共通入力シート【記載必須】'!$E$7","v":"玉東町"},{"$f":"'1_共通入力シート【記載必須】'!$F$7","v":"熊本県玉東町"},null,null,null,null,null,null,{"$f":"IFERROR(VLOOKUP(GK9,リンク先!$F$3:$J$9,1+GL9,0),\"\")","v":""},0,null,0,{"$f":"O9-P9","v":0},null,0,null,null,0,null,null,0,null,null,0,null,null,0,null,null,0,null,null,0,null,null,0,null,null,0,null,null,0,null,null,null,null,0,0,0,null,null,null,null,{"$f":"DATEVALUE(BF9&\"年12月31日\")","v":{"$error":"#VALUE!"}},2026,{"$f":"'1_共通入力シート【記載必須】'!$G$7","v":"　結婚・妊娠・共育ての相談機会提供・支援プログラムを実施し、結婚に伴う新生活を経済的に支援するため新生活費用に対して補助を行う。\n　また、荒尾・玉名地域結婚サポートセンター（有明広域行政事務組合）と連携して婚活事業を実施し、出会いの場の創出を重点的に行う。事業実施後には、対象者にアンケート調査等を行い、次年度以降により効果的な取組を行えるように留意する。"},null,null,null,null,null,null,null,null,null,null,null,null,null,null,null,null,null,null,null,null,null,null,{"$f":"IF('1_共通入力シート【記載必須】'!H$7=\"\",\"\",'1_共通入力シート【記載必須】'!H$7)","v":"荒尾・玉名地域結婚サポートセンター新規会員数"},{"$f":"IF('1_共通入力シート【記載必須】'!I$7=\"\",\"\",'1_共通入力シート【記載必須】'!I$7)","v":"人"},{"$f":"IF('1_共通入力シート【記載必須】'!J$7=\"\",\"\",'1_共通入力シート【記載必須】'!J$7)","v":"1\n（R7年度～R11年度）"},{"$f":"IF('1_共通入力シート【記載必須】'!K$7=\"\",\"\",'1_共通入力シート【記載必須】'!K$7)","v":"0\n（R6年度\n1月時点）"},{"$f":"IF('1_共通入力シート【記載必須】'!L$7=\"\",\"\",'1_共通入力シート【記載必須】'!L$7)","v":"不妊治療補助件数"},{"$f":"IF('1_共通入力シート【記載必須】'!M$7=\"\",\"\",'1_共通入力シート【記載必須】'!M$7)","v":"件"},{"$f":"IF('1_共通入力シート【記載必須】'!N$7=\"\",\"\",'1_共通入力シート【記載必須】'!N$7)","v":"5\n（R7年度～R11年度）"},{"$f":"IF('1_共通入力シート【記載必須】'!O$7=\"\",\"\",'1_共通入力シート【記載必須】'!O$7)","v":"3\n（R6.4～R7.2）"},{"$f":"IF('1_共通入力シート【記載必須】'!P$7=\"\",\"\",'1_共通入力シート【記載必須】'!P$7)","v":"子育て関連講座参加者数"},{"$f":"IF('1_共通入力シート【記載必須】'!Q$7=\"\",\"\",'1_共通入力シート【記載必須】'!Q$7)","v":"人"},{"$f":"IF('1_共通入力シート【記載必須】'!R$7=\"\",\"\",'1_共通入力シート【記載必須】'!R$7)","v":"488\n（R7年度～R11年度）"},{"$f":"IF('1_共通入力シート【記載必須】'!S$7=\"\",\"\",'1_共通入力シート【記載必須】'!S$7)","v":"487\n（R6.4～R7.1）"},{"$f":"IF('1_共通入力シート【記載必須】'!T$7=\"\",\"\",'1_共通入力シート【記載必須】'!T$7)","v":"こども家庭センターにおける相談支援件数"},{"$f":"IF('1_共通入力シート【記載必須】'!U$7=\"\",\"\",'1_共通入力シート【記載必須】'!U$7)","v":"件"},{"$f":"IF('1_共通入力シート【記載必須】'!V$7=\"\",\"\",'1_共通入力シート【記載必須】'!V$7)","v":"60/年\n（R7年度～R11年度）"},{"$f":"IF('1_共通入力シート【記載必須】'!W$7=\"\",\"\",'1_共通入力シート【記載必須】'!W$7)","v":"47/年\n（R6.4～R7.1）"},{"$f":"IF('1_共通入力シート【記載必須】'!X$7=\"\",\"\",'1_共通入力シート【記載必須】'!X$7)","v":""},{"$f":"IF('1_共通入力シート【記載必須】'!Y$7=\"\",\"\",'1_共通入力シート【記載必須】'!Y$7)","v":""},{"$f":"IF('1_共通入力シート【記載必須】'!Z$7=\"\",\"\",'1_共通入力シート【記載必須】'!Z$7)","v":""},{"$f":"IF('1_共通入力シート【記載必須】'!AA$7=\"\",\"\",'1_共通入力シート【記載必須】'!AA$7)","v":""},{"$f":"IF('1_共通入力シート【記載必須】'!AB$7=\"\",\"\",'1_共通入力シート【記載必須】'!AB$7)","v":"合計特殊出生率"},{"$f":"IF('1_共通入力シート【記載必須】'!AC$7=\"\",\"\",'1_共通入力シート【記載必須】'!AC$7)","v":""},{"$f":"IF('1_共通入力シート【記載必須】'!AD$7=\"\",\"\",'1_共通入力シート【記載必須】'!AD$7)","v":"2.44\n（R6年）"},{"$f":"IF('1_共通入力シート【記載必須】'!AE$7=\"\",\"\",'1_共通入力シート【記載必須】'!AE$7)","v":"婚姻件数"},{"$f":"IF('1_共通入力シート【記載必須】'!AF$7=\"\",\"\",'1_共通入力シート【記載必須】'!AF$7)","v":"件"},{"$f":"IF('1_共通入力シート【記載必須】'!AG$7=\"\",\"\",'1_共通入力シート【記載必須】'!AG$7)","v":"22\n（R6年）"},{"$f":"IF('1_共通入力シート【記載必須】'!AH$7=\"\",\"\",'1_共通入力シート【記載必須】'!AH$7)","v":"婚姻率"},{"$f":"IF('1_共通入力シート【記載必須】'!AI$7=\"\",\"\",'1_共通入力シート【記載必須】'!AI$7)","v":""},{"$f":"IF('1_共通入力シート【記載必須】'!AJ$7=\"\",\"\",'1_共通入力シート【記載必須】'!AJ$7)","v":"4.27\n（R6年）"},null,null,null,null,null,null,null,null,null,null,null,null,null,null,null,null,null,null,null,null,"交付金事業に対する事業対象者（住民等）の満足度\n\n※該当事業のみ必須","％",null,null,"希望どおりの結婚に向けて後押ししてくれたと感じた人の割合\n\n※該当事業のみ必須","％",null,null,"結婚、妊娠・出産、子育てに前向きになったと感じた人の割合\n\n※該当事業のみ必須","％",null,null,null,null,null,null,null,null,null,null,null,null,null,null,null,null,null,null,null,null,null,null,null,null,null,{"$f":"IF(OR(FN9=\"NG\",FP9=\"NG\",FR9=\"NG\",FT9=\"NG\",FV9=\"NG\",FX9=\"NG\"),\"NG\",\"OK\")","v":"NG"},null,{"$f":"IF(FM9=\"含まれていない\",\"OK\",\"NG\")","v":"NG"},null,{"$f":"IF(FO9=\"含まれていない\",\"OK\",\"NG\")","v":"NG"},null,{"$f":"IF(FQ9=\"含まれていない\",\"OK\",\"NG\")","v":"NG"},null,{"$f":"IF(FS9=\"含まれていない\",\"OK\",\"NG\")","v":"NG"},null,{"$f":"IF(OR(FU9=\"含まれている（留意点等の要件ア〜エを満たしている）\",FU9=\"含まれていない\"),\"OK\",\"NG\")","v":"NG"},null,{"$f":"IF(FW9=\"含まれていない\",\"OK\",\"NG\")","v":"NG"},{"$f":"IF(OR(GB9=\"NG\",GE9=\"NG\",GH9=\"NG\"),\"NG\",\"OK\")","v":"OK"},{"$f":"IFERROR(VLOOKUP($L9,リンク先!$E$147:$M$157,2,FALSE)&\"\",\"\")","v":""},null,{"$f":"IF(OR(GA9=\"○\",FZ9=\"\"),\"OK\",\"NG\")","v":"OK"},{"$f":"IFERROR(VLOOKUP($L9,リンク先!$E$147:$M$157,3,FALSE)&\"\",\"\")","v":""},null,{"$f":"IF(OR(GD9=\"○\",GC9=\"\"),\"OK\",\"NG\")","v":"OK"},{"$f":"IFERROR(VLOOKUP($L9,リンク先!$E$147:$M$157,4,FALSE)&\"\",\"\")","v":""},null,{"$f":"IF(OR(GG9=\"○\",GF9=\"\"),\"OK\",\"NG\")","v":"OK"},null,null,"",{"$f":"IF(I9=リンク先!$C$12,4,VLOOKUP('1_共通入力シート【記載必須】'!$B$7,補助率判定!$B:$I,8,0))","v":2}]
[null,"④",{"$f":"'1_共通入力シート【記載必須】'!$B$7","v":"433641"},{"$f":"'1_共通入力シート【記載必須】'!$C$7","v":"市町村"},{"$f":"'1_共通入力シート【記載必須】'!$D$7","v":"熊本県"},{"$f":"'1_共通入力シート【記載必須】'!$E$7","v":"玉東町"},{"$f":"'1_共通入力シート【記載必須】'!$F$7","v":"熊本県玉東町"},null,null,null,null,null,null,{"$f":"IFERROR(VLOOKUP(GK10,リンク先!$F$3:$J$9,1+GL10,0),\"\")","v":""},{"$f":"AZ10","v":0},null,{"$f":"BA10","v":0},{"$f":"O10-P10","v":0},null,0,null,null,0,null,null,0,null,null,0,null,null,0,null,null,0,null,null,0,null,null,0,null,null,0,null,null,0,null,null,null,null,0,0,0,null,null,null,null,{"$f":"DATEVALUE(BF10&\"年12月31日\")","v":{"$error":"#VALUE!"}},2026,{"$f":"'1_共通入力シート【記載必須】'!$G$7","v":"　結婚・妊娠・共育ての相談機会提供・支援プログラムを実施し、結婚に伴う新生活を経済的に支援するため新生活費用に対して補助を行う。\n　また、荒尾・玉名地域結婚サポートセンター（有明広域行政事務組合）と連携して婚活事業を実施し、出会いの場の創出を重点的に行う。事業実施後には、対象者にアンケート調査等を行い、次年度以降により効果的な取組を行えるように留意する。"},null,null,null,null,null,null,null,null,null,null,null,null,null,null,null,null,null,null,null,null,null,null,{"$f":"IF('1_共通入力シート【記載必須】'!H$7=\"\",\"\",'1_共通入力シート【記載必須】'!H$7)","v":"荒尾・玉名地域結婚サポートセンター新規会員数"},{"$f":"IF('1_共通入力シート【記載必須】'!I$7=\"\",\"\",'1_共通入力シート【記載必須】'!I$7)","v":"人"},{"$f":"IF('1_共通入力シート【記載必須】'!J$7=\"\",\"\",'1_共通入力シート【記載必須】'!J$7)","v":"1\n（R7年度～R11年度）"},{"$f":"IF('1_共通入力シート【記載必須】'!K$7=\"\",\"\",'1_共通入力シート【記載必須】'!K$7)","v":"0\n（R6年度\n1月時点）"},{"$f":"IF('1_共通入力シート【記載必須】'!L$7=\"\",\"\",'1_共通入力シート【記載必須】'!L$7)","v":"不妊治療補助件数"},{"$f":"IF('1_共通入力シート【記載必須】'!M$7=\"\",\"\",'1_共通入力シート【記載必須】'!M$7)","v":"件"},{"$f":"IF('1_共通入力シート【記載必須】'!N$7=\"\",\"\",'1_共通入力シート【記載必須】'!N$7)","v":"5\n（R7年度～R11年度）"},{"$f":"IF('1_共通入力シート【記載必須】'!O$7=\"\",\"\",'1_共通入力シート【記載必須】'!O$7)","v":"3\n（R6.4～R7.2）"},{"$f":"IF('1_共通入力シート【記載必須】'!P$7=\"\",\"\",'1_共通入力シート【記載必須】'!P$7)","v":"子育て関連講座参加者数"},{"$f":"IF('1_共通入力シート【記載必須】'!Q$7=\"\",\"\",'1_共通入力シート【記載必須】'!Q$7)","v":"人"},{"$f":"IF('1_共通入力シート【記載必須】'!R$7=\"\",\"\",'1_共通入力シート【記載必須】'!R$7)","v":"488\n（R7年度～R11年度）"},{"$f":"IF('1_共通入力シート【記載必須】'!S$7=\"\",\"\",'1_共通入力シート【記載必須】'!S$7)","v":"487\n（R6.4～R7.1）"},{"$f":"IF('1_共通入力シート【記載必須】'!T$7=\"\",\"\",'1_共通入力シート【記載必須】'!T$7)","v":"こども家庭センターにおける相談支援件数"},{"$f":"IF('1_共通入力シート【記載必須】'!U$7=\"\",\"\",'1_共通入力シート【記載必須】'!U$7)","v":"件"},{"$f":"IF('1_共通入力シート【記載必須】'!V$7=\"\",\"\",'1_共通入力シート【記載必須】'!V$7)","v":"60/年\n（R7年度～R11年度）"},{"$f":"IF('1_共通入力シート【記載必須】'!W$7=\"\",\"\",'1_共通入力シート【記載必須】'!W$7)","v":"47/年\n（R6.4～R7.1）"},{"$f":"IF('1_共通入力シート【記載必須】'!X$7=\"\",\"\",'1_共通入力シート【記載必須】'!X$7)","v":""},{"$f":"IF('1_共通入力シート【記載必須】'!Y$7=\"\",\"\",'1_共通入力シート【記載必須】'!Y$7)","v":""},{"$f":"IF('1_共通入力シート【記載必須】'!Z$7=\"\",\"\",'1_共通入力シート【記載必須】'!Z$7)","v":""},{"$f":"IF('1_共通入力シート【記載必須】'!AA$7=\"\",\"\",'1_共通入力シート【記載必須】'!AA$7)","v":""},{"$f":"IF('1_共通入力シート【記載必須】'!AB$7=\"\",\"\",'1_共通入力シート【記載必須】'!AB$7)","v":"合計特殊出生率"},{"$f":"IF('1_共通入力シート【記載必須】'!AC$7=\"\",\"\",'1_共通入力シート【記載必須】'!AC$7)","v":""},{"$f":"IF('1_共通入力シート【記載必須】'!AD$7=\"\",\"\",'1_共通入力シート【記載必須】'!AD$7)","v":"2.44\n（R6年）"},{"$f":"IF('1_共通入力シート【記載必須】'!AE$7=\"\",\"\",'1_共通入力シート【記載必須】'!AE$7)","v":"婚姻件数"},{"$f":"IF('1_共通入力シート【記載必須】'!AF$7=\"\",\"\",'1_共通入力シート【記載必須】'!AF$7)","v":"件"},{"$f":"IF('1_共通入力シート【記載必須】'!AG$7=\"\",\"\",'1_共通入力シート【記載必須】'!AG$7)","v":"22\n（R6年）"},{"$f":"IF('1_共通入力シート【記載必須】'!AH$7=\"\",\"\",'1_共通入力シート【記載必須】'!AH$7)","v":"婚姻率"},{"$f":"IF('1_共通入力シート【記載必須】'!AI$7=\"\",\"\",'1_共通入力シート【記載必須】'!AI$7)","v":""},{"$f":"IF('1_共通入力シート【記載必須】'!AJ$7=\"\",\"\",'1_共通入力シート【記載必須】'!AJ$7)","v":"4.27\n（R6年）"},null,null,null,null,null,null,null,null,null,null,null,null,null,null,null,null,null,null,null,null,"交付金事業に対する事業対象者（住民等）の満足度\n\n※該当事業のみ必須","％",null,null,"希望どおりの結婚に向けて後押ししてくれたと感じた人の割合\n\n※該当事業のみ必須","％",null,null,"結婚、妊娠・出産、子育てに前向きになったと感じた人の割合\n\n※該当事業のみ必須","％",null,null,null,null,null,null,null,null,null,null,null,null,null,null,null,null,null,null,null,null,null,null,null,null,null,"NG",null,{"$f":"IF(FM10=\"含まれていない\",\"OK\",\"NG\")","v":"NG"},null,"NG",null,{"$f":"IF(FQ10=\"含まれていない\",\"OK\",\"NG\")","v":"NG"},null,{"$f":"IF(FS10=\"含まれていない\",\"OK\",\"NG\")","v":"NG"},null,"NG",null,{"$f":"IF(FW10=\"含まれていない\",\"OK\",\"NG\")","v":"NG"},"OK",{"$f":"IFERROR(VLOOKUP($L10,リンク先!$E$147:$M$157,2,FALSE)&\"\",\"\")","v":""},null,{"$f":"IF(OR(GA10=\"○\",FZ10=\"\"),\"OK\",\"NG\")","v":"OK"},{"$f":"IFERROR(VLOOKUP($L10,リンク先!$E$147:$M$157,3,FALSE)&\"\",\"\")","v":""},null,{"$f":"IF(OR(GD10=\"○\",GC10=\"\"),\"OK\",\"NG\")","v":"OK"},{"$f":"IFERROR(VLOOKUP($L10,リンク先!$E$147:$M$157,4,FALSE)&\"\",\"\")","v":""},null,{"$f":"IF(OR(GG10=\"○\",GF10=\"\"),\"OK\",\"NG\")","v":"OK"},null,null,"",{"$f":"IF(I10=リンク先!$C$12,4,VLOOKUP('1_共通入力シート【記載必須】'!$B$7,補助率判定!$B:$I,8,0))","v":2}]
[null,"⑤",{"$f":"'1_共通入力シート【記載必須】'!$B$7","v":"433641"},{"$f":"'1_共通入力シート【記載必須】'!$C$7","v":"市町村"},{"$f":"'1_共通入力シート【記載必須】'!$D$7","v":"熊本県"},{"$f":"'1_共通入力シート【記載必須】'!$E$7","v":"玉東町"},{"$f":"'1_共通入力シート【記載必須】'!$F$7","v":"熊本県玉東町"},null,null,null,null,null,null,{"$f":"IFERROR(VLOOKUP(GK11,リンク先!$F$3:$J$9,1+GL11,0),\"\")","v":""},0,null,0,0,null,0,null,null,0,null,null,0,null,null,0,null,null,0,null,null,0,null,null,0,null,null,0,null,null,0,null,null,0,null,null,null,null,0,0,0,null,null,null,null,{"$error":"#VALUE!"},2026,{"$f":"'1_共通入力シート【記載必須】'!$G$7","v":"　結婚・妊娠・共育ての相談機会提供・支援プログラムを実施し、結婚に伴う新生活を経済的に支援するため新生活費用に対して補助を行う。\n　また、荒尾・玉名地域結婚サポートセンター（有明広域行政事務組合）と連携して婚活事業を実施し、出会いの場の創出を重点的に行う。事業実施後には、対象者にアンケート調査等を行い、次年度以降により効果的な取組を行えるように留意する。"},null,null,null,null,null,null,null,null,null,null,null,null,null,null,null,null,null,null,null,null,null,null,{"$f":"IF('1_共通入力シート【記載必須】'!H$7=\"\",\"\",'1_共通入力シート【記載必須】'!H$7)","v":"荒尾・玉名地域結婚サポートセンター新規会員数"},{"$f":"IF('1_共通入力シート【記載必須】'!I$7=\"\",\"\",'1_共通入力シート【記載必須】'!I$7)","v":"人"},{"$f":"IF('1_共通入力シート【記載必須】'!J$7=\"\",\"\",'1_共通入力シート【記載必須】'!J$7)","v":"1\n（R7年度～R11年度）"},{"$f":"IF('1_共通入力シート【記載必須】'!K$7=\"\",\"\",'1_共通入力シート【記載必須】'!K$7)","v":"0\n（R6年度\n1月時点）"},{"$f":"IF('1_共通入力シート【記載必須】'!L$7=\"\",\"\",'1_共通入力シート【記載必須】'!L$7)","v":"不妊治療補助件数"},{"$f":"IF('1_共通入力シート【記載必須】'!M$7=\"\",\"\",'1_共通入力シート【記載必須】'!M$7)","v":"件"},{"$f":"IF('1_共通入力シート【記載必須】'!N$7=\"\",\"\",'1_共通入力シート【記載必須】'!N$7)","v":"5\n（R7年度～R11年度）"},{"$f":"IF('1_共通入力シート【記載必須】'!O$7=\"\",\"\",'1_共通入力シート【記載必須】'!O$7)","v":"3\n（R6.4～R7.2）"},{"$f":"IF('1_共通入力シート【記載必須】'!P$7=\"\",\"\",'1_共通入力シート【記載必須】'!P$7)","v":"子育て関連講座参加者数"},{"$f":"IF('1_共通入力シート【記載必須】'!Q$7=\"\",\"\",'1_共通入力シート【記載必須】'!Q$7)","v":"人"},{"$f":"IF('1_共通入力シート【記載必須】'!R$7=\"\",\"\",'1_共通入力シート【記載必須】'!R$7)","v":"488\n（R7年度～R11年度）"},{"$f":"IF('1_共通入力シート【記載必須】'!S$7=\"\",\"\",'1_共通入力シート【記載必須】'!S$7)","v":"487\n（R6.4～R7.1）"},{"$f":"IF('1_共通入力シート【記載必須】'!T$7=\"\",\"\",'1_共通入力シート【記載必須】'!T$7)","v":"こども家庭センターにおける相談支援件数"},{"$f":"IF('1_共通入力シート【記載必須】'!U$7=\"\",\"\",'1_共通入力シート【記載必須】'!U$7)","v":"件"},{"$f":"IF('1_共通入力シート【記載必須】'!V$7=\"\",\"\",'1_共通入力シート【記載必須】'!V$7)","v":"60/年\n（R7年度～R11年度）"},{"$f":"IF('1_共通入力シート【記載必須】'!W$7=\"\",\"\",'1_共通入力シート【記載必須】'!W$7)","v":"47/年\n（R6.4～R7.1）"},{"$f":"IF('1_共通入力シート【記載必須】'!X$7=\"\",\"\",'1_共通入力シート【記載必須】'!X$7)","v":""},{"$f":"IF('1_共通入力シート【記載必須】'!Y$7=\"\",\"\",'1_共通入力シート【記載必須】'!Y$7)","v":""},{"$f":"IF('1_共通入力シート【記載必須】'!Z$7=\"\",\"\",'1_共通入力シート【記載必須】'!Z$7)","v":""},{"$f":"IF('1_共通入力シート【記載必須】'!AA$7=\"\",\"\",'1_共通入力シート【記載必須】'!AA$7)","v":""},{"$f":"IF('1_共通入力シート【記載必須】'!AB$7=\"\",\"\",'1_共通入力シート【記載必須】'!AB$7)","v":"合計特殊出生率"},{"$f":"IF('1_共通入力シート【記載必須】'!AC$7=\"\",\"\",'1_共通入力シート【記載必須】'!AC$7)","v":""},{"$f":"IF('1_共通入力シート【記載必須】'!AD$7=\"\",\"\",'1_共通入力シート【記載必須】'!AD$7)","v":"2.44\n（R6年）"},{"$f":"IF('1_共通入力シート【記載必須】'!AE$7=\"\",\"\",'1_共通入力シート【記載必須】'!AE$7)","v":"婚姻件数"},{"$f":"IF('1_共通入力シート【記載必須】'!AF$7=\"\",\"\",'1_共通入力シート【記載必須】'!AF$7)","v":"件"},{"$f":"IF('1_共通入力シート【記載必須】'!AG$7=\"\",\"\",'1_共通入力シート【記載必須】'!AG$7)","v":"22\n（R6年）"},{"$f":"IF('1_共通入力シート【記載必須】'!AH$7=\"\",\"\",'1_共通入力シート【記載必須】'!AH$7)","v":"婚姻率"},{"$f":"IF('1_共通入力シート【記載必須】'!AI$7=\"\",\"\",'1_共通入力シート【記載必須】'!AI$7)","v":""},{"$f":"IF('1_共通入力シート【記載必須】'!AJ$7=\"\",\"\",'1_共通入力シート【記載必須】'!AJ$7)","v":"4.27\n（R6年）"},null,null,null,null,null,null,null,null,null,null,null,null,null,null,null,null,null,null,null,null,"交付金事業に対する事業対象者（住民等）の満足度\n\n※該当事業のみ必須","％",null,null,"希望どおりの結婚に向けて後押ししてくれたと感じた人の割合\n\n※該当事業のみ必須","％",null,null,"結婚、妊娠・出産、子育てに前向きになったと感じた人の割合\n\n※該当事業のみ必須","％",null,null,null,null,null,null,null,null,null,null,null,null,null,null,null,null,null,null,null,null,null,null,null,null,null,"NG",null,"NG",null,"NG",null,"NG",null,"NG",null,"NG",null,"NG","OK",{"$f":"IFERROR(VLOOKUP($L11,リンク先!$E$147:$M$157,2,FALSE)&\"\",\"\")","v":""},null,"OK",{"$f":"IFERROR(VLOOKUP($L11,リンク先!$E$147:$M$157,3,FALSE)&\"\",\"\")","v":""},null,"OK",{"$f":"IFERROR(VLOOKUP($L11,リンク先!$E$147:$M$157,4,FALSE)&\"\",\"\")","v":""},null,"OK",null,null,"",{"$f":"IF(I11=リンク先!$C$12,4,VLOOKUP('1_共通入力シート【記載必須】'!$B$7,補助率判定!$B:$I,8,0))","v":2}]
[null,"⑥",{"$f":"'1_共通入力シート【記載必須】'!$B$7","v":"433641"},{"$f":"'1_共通入力シート【記載必須】'!$C$7","v":"市町村"},{"$f":"'1_共通入力シート【記載必須】'!$D$7","v":"熊本県"},{"$f":"'1_共通入力シート【記載必須】'!$E$7","v":"玉東町"},{"$f":"'1_共通入力シート【記載必須】'!$F$7","v":"熊本県玉東町"},null,null,null,null,null,null,{"$f":"IFERROR(VLOOKUP(GK12,リンク先!$F$3:$J$9,1+GL12,0),\"\")","v":""},0,null,0,0,null,0,null,null,0,null,null,0,null,null,0,null,null,0,null,null,0,null,null,0,null,null,0,null,null,0,null,null,0,null,null,null,null,0,0,0,null,null,null,null,{"$error":"#VALUE!"},2026,{"$f":"'1_共通入力シート【記載必須】'!$G$7","v":"　結婚・妊娠・共育ての相談機会提供・支援プログラムを実施し、結婚に伴う新生活を経済的に支援するため新生活費用に対して補助を行う。\n　また、荒尾・玉名地域結婚サポートセンター（有明広域行政事務組合）と連携して婚活事業を実施し、出会いの場の創出を重点的に行う。事業実施後には、対象者にアンケート調査等を行い、次年度以降により効果的な取組を行えるように留意する。"},null,null,null,null,null,null,null,null,null,null,null,null,null,null,null,null,null,null,null,null,null,null,{"$f":"IF('1_共通入力シート【記載必須】'!H$7=\"\",\"\",'1_共通入力シート【記載必須】'!H$7)","v":"荒尾・玉名地域結婚サポートセンター新規会員数"},{"$f":"IF('1_共通入力シート【記載必須】'!I$7=\"\",\"\",'1_共通入力シート【記載必須】'!I$7)","v":"人"},{"$f":"IF('1_共通入力シート【記載必須】'!J$7=\"\",\"\",'1_共通入力シート【記載必須】'!J$7)","v":"1\n（R7年度～R11年度）"},{"$f":"IF('1_共通入力シート【記載必須】'!K$7=\"\",\"\",'1_共通入力シート【記載必須】'!K$7)","v":"0\n（R6年度\n1月時点）"},{"$f":"IF('1_共通入力シート【記載必須】'!L$7=\"\",\"\",'1_共通入力シート【記載必須】'!L$7)","v":"不妊治療補助件数"},{"$f":"IF('1_共通入力シート【記載必須】'!M$7=\"\",\"\",'1_共通入力シート【記載必須】'!M$7)","v":"件"},{"$f":"IF('1_共通入力シート【記載必須】'!N$7=\"\",\"\",'1_共通入力シート【記載必須】'!N$7)","v":"5\n（R7年度～R11年度）"},{"$f":"IF('1_共通入力シート【記載必須】'!O$7=\"\",\"\",'1_共通入力シート【記載必須】'!O$7)","v":"3\n（R6.4～R7.2）"},{"$f":"IF('1_共通入力シート【記載必須】'!P$7=\"\",\"\",'1_共通入力シート【記載必須】'!P$7)","v":"子育て関連講座参加者数"},{"$f":"IF('1_共通入力シート【記載必須】'!Q$7=\"\",\"\",'1_共通入力シート【記載必須】'!Q$7)","v":"人"},{"$f":"IF('1_共通入力シート【記載必須】'!R$7=\"\",\"\",'1_共通入力シート【記載必須】'!R$7)","v":"488\n（R7年度～R11年度）"},{"$f":"IF('1_共通入力シート【記載必須】'!S$7=\"\",\"\",'1_共通入力シート【記載必須】'!S$7)","v":"487\n（R6.4～R7.1）"},{"$f":"IF('1_共通入力シート【記載必須】'!T$7=\"\",\"\",'1_共通入力シート【記載必須】'!T$7)","v":"こども家庭センターにおける相談支援件数"},{"$f":"IF('1_共通入力シート【記載必須】'!U$7=\"\",\"\",'1_共通入力シート【記載必須】'!U$7)","v":"件"},{"$f":"IF('1_共通入力シート【記載必須】'!V$7=\"\",\"\",'1_共通入力シート【記載必須】'!V$7)","v":"60/年\n（R7年度～R11年度）"},{"$f":"IF('1_共通入力シート【記載必須】'!W$7=\"\",\"\",'1_共通入力シート【記載必須】'!W$7)","v":"47/年\n（R6.4～R7.1）"},{"$f":"IF('1_共通入力シート【記載必須】'!X$7=\"\",\"\",'1_共通入力シート【記載必須】'!X$7)","v":""},{"$f":"IF('1_共通入力シート【記載必須】'!Y$7=\"\",\"\",'1_共通入力シート【記載必須】'!Y$7)","v":""},{"$f":"IF('1_共通入力シート【記載必須】'!Z$7=\"\",\"\",'1_共通入力シート【記載必須】'!Z$7)","v":""},{"$f":"IF('1_共通入力シート【記載必須】'!AA$7=\"\",\"\",'1_共通入力シート【記載必須】'!AA$7)","v":""},{"$f":"IF('1_共通入力シート【記載必須】'!AB$7=\"\",\"\",'1_共通入力シート【記載必須】'!AB$7)","v":"合計特殊出生率"},{"$f":"IF('1_共通入力シート【記載必須】'!AC$7=\"\",\"\",'1_共通入力シート【記載必須】'!AC$7)","v":""},{"$f":"IF('1_共通入力シート【記載必須】'!AD$7=\"\",\"\",'1_共通入力シート【記載必須】'!AD$7)","v":"2.44\n（R6年）"},{"$f":"IF('1_共通入力シート【記載必須】'!AE$7=\"\",\"\",'1_共通入力シート【記載必須】'!AE$7)","v":"婚姻件数"},{"$f":"IF('1_共通入力シート【記載必須】'!AF$7=\"\",\"\",'1_共通入力シート【記載必須】'!AF$7)","v":"件"},{"$f":"IF('1_共通入力シート【記載必須】'!AG$7=\"\",\"\",'1_共通入力シート【記載必須】'!AG$7)","v":"22\n（R6年）"},{"$f":"IF('1_共通入力シート【記載必須】'!AH$7=\"\",\"\",'1_共通入力シート【記載必須】'!AH$7)","v":"婚姻率"},{"$f":"IF('1_共通入力シート【記載必須】'!AI$7=\"\",\"\",'1_共通入力シート【記載必須】'!AI$7)","v":""},{"$f":"IF('1_共通入力シート【記載必須】'!AJ$7=\"\",\"\",'1_共通入力シート【記載必須】'!AJ$7)","v":"4.27\n（R6年）"},null,null,null,null,null,null,null,null,null,null,null,null,null,null,null,null,null,null,null,null,"交付金事業に対する事業対象者（住民等）の満足度\n\n※該当事業のみ必須","％",null,null,"希望どおりの結婚に向けて後押ししてくれたと感じた人の割合\n\n※該当事業のみ必須","％",null,null,"結婚、妊娠・出産、子育てに前向きになったと感じた人の割合\n\n※該当事業のみ必須","％",null,null,null,null,null,null,null,null,null,null,null,null,null,null,null,null,null,null,null,null,null,null,null,null,null,"NG",null,"NG",null,"NG",null,"NG",null,"NG",null,"NG",null,"NG","OK",{"$f":"IFERROR(VLOOKUP($L12,リンク先!$E$147:$M$157,2,FALSE)&\"\",\"\")","v":""},null,"OK",{"$f":"IFERROR(VLOOKUP($L12,リンク先!$E$147:$M$157,3,FALSE)&\"\",\"\")","v":""},null,"OK",{"$f":"IFERROR(VLOOKUP($L12,リンク先!$E$147:$M$157,4,FALSE)&\"\",\"\")","v":""},null,"OK",null,null,"",{"$f":"IF(I12=リンク先!$C$12,4,VLOOKUP('1_共通入力シート【記載必須】'!$B$7,補助率判定!$B:$I,8,0))","v":2}]
[null,"⑦",{"$f":"'1_共通入力シート【記載必須】'!$B$7","v":"433641"},{"$f":"'1_共通入力シート【記載必須】'!$C$7","v":"市町村"},{"$f":"'1_共通入力シート【記載必須】'!$D$7","v":"熊本県"},{"$f":"'1_共通入力シート【記載必須】'!$E$7","v":"玉東町"},{"$f":"'1_共通入力シート【記載必須】'!$F$7","v":"熊本県玉東町"},null,null,null,null,null,null,{"$f":"IFERROR(VLOOKUP(GK13,リンク先!$F$3:$J$9,1+GL13,0),\"\")","v":""},0,null,0,0,null,0,null,null,0,null,null,0,null,null,0,null,null,0,null,null,0,null,null,0,null,null,0,null,null,0,null,null,0,null,null,null,null,0,0,0,null,null,null,null,{"$error":"#VALUE!"},2026,{"$f":"'1_共通入力シート【記載必須】'!$G$7","v":"　結婚・妊娠・共育ての相談機会提供・支援プログラムを実施し、結婚に伴う新生活を経済的に支援するため新生活費用に対して補助を行う。\n　また、荒尾・玉名地域結婚サポートセンター（有明広域行政事務組合）と連携して婚活事業を実施し、出会いの場の創出を重点的に行う。事業実施後には、対象者にアンケート調査等を行い、次年度以降により効果的な取組を行えるように留意する。"},null,null,null,null,null,null,null,null,null,null,null,null,null,null,null,null,null,null,null,null,null,null,{"$f":"IF('1_共通入力シート【記載必須】'!H$7=\"\",\"\",'1_共通入力シート【記載必須】'!H$7)","v":"荒尾・玉名地域結婚サポートセンター新規会員数"},{"$f":"IF('1_共通入力シート【記載必須】'!I$7=\"\",\"\",'1_共通入力シート【記載必須】'!I$7)","v":"人"},{"$f":"IF('1_共通入力シート【記載必須】'!J$7=\"\",\"\",'1_共通入力シート【記載必須】'!J$7)","v":"1\n（R7年度～R11年度）"},{"$f":"IF('1_共通入力シート【記載必須】'!K$7=\"\",\"\",'1_共通入力シート【記載必須】'!K$7)","v":"0\n（R6年度\n1月時点）"},{"$f":"IF('1_共通入力シート【記載必須】'!L$7=\"\",\"\",'1_共通入力シート【記載必須】'!L$7)","v":"不妊治療補助件数"},{"$f":"IF('1_共通入力シート【記載必須】'!M$7=\"\",\"\",'1_共通入力シート【記載必須】'!M$7)","v":"件"},{"$f":"IF('1_共通入力シート【記載必須】'!N$7=\"\",\"\",'1_共通入力シート【記載必須】'!N$7)","v":"5\n（R7年度～R11年度）"},{"$f":"IF('1_共通入力シート【記載必須】'!O$7=\"\",\"\",'1_共通入力シート【記載必須】'!O$7)","v":"3\n（R6.4～R7.2）"},{"$f":"IF('1_共通入力シート【記載必須】'!P$7=\"\",\"\",'1_共通入力シート【記載必須】'!P$7)","v":"子育て関連講座参加者数"},{"$f":"IF('1_共通入力シート【記載必須】'!Q$7=\"\",\"\",'1_共通入力シート【記載必須】'!Q$7)","v":"人"},{"$f":"IF('1_共通入力シート【記載必須】'!R$7=\"\",\"\",'1_共通入力シート【記載必須】'!R$7)","v":"488\n（R7年度～R11年度）"},{"$f":"IF('1_共通入力シート【記載必須】'!S$7=\"\",\"\",'1_共通入力シート【記載必須】'!S$7)","v":"487\n（R6.4～R7.1）"},{"$f":"IF('1_共通入力シート【記載必須】'!T$7=\"\",\"\",'1_共通入力シート【記載必須】'!T$7)","v":"こども家庭センターにおける相談支援件数"},{"$f":"IF('1_共通入力シート【記載必須】'!U$7=\"\",\"\",'1_共通入力シート【記載必須】'!U$7)","v":"件"},{"$f":"IF('1_共通入力シート【記載必須】'!V$7=\"\",\"\",'1_共通入力シート【記載必須】'!V$7)","v":"60/年\n（R7年度～R11年度）"},{"$f":"IF('1_共通入力シート【記載必須】'!W$7=\"\",\"\",'1_共通入力シート【記載必須】'!W$7)","v":"47/年\n（R6.4～R7.1）"},{"$f":"IF('1_共通入力シート【記載必須】'!X$7=\"\",\"\",'1_共通入力シート【記載必須】'!X$7)","v":""},{"$f":"IF('1_共通入力シート【記載必須】'!Y$7=\"\",\"\",'1_共通入力シート【記載必須】'!Y$7)","v":""},{"$f":"IF('1_共通入力シート【記載必須】'!Z$7=\"\",\"\",'1_共通入力シート【記載必須】'!Z$7)","v":""},{"$f":"IF('1_共通入力シート【記載必須】'!AA$7=\"\",\"\",'1_共通入力シート【記載必須】'!AA$7)","v":""},{"$f":"IF('1_共通入力シート【記載必須】'!AB$7=\"\",\"\",'1_共通入力シート【記載必須】'!AB$7)","v":"合計特殊出生率"},{"$f":"IF('1_共通入力シート【記載必須】'!AC$7=\"\",\"\",'1_共通入力シート【記載必須】'!AC$7)","v":""},{"$f":"IF('1_共通入力シート【記載必須】'!AD$7=\"\",\"\",'1_共通入力シート【記載必須】'!AD$7)","v":"2.44\n（R6年）"},{"$f":"IF('1_共通入力シート【記載必須】'!AE$7=\"\",\"\",'1_共通入力シート【記載必須】'!AE$7)","v":"婚姻件数"},{"$f":"IF('1_共通入力シート【記載必須】'!AF$7=\"\",\"\",'1_共通入力シート【記載必須】'!AF$7)","v":"件"},{"$f":"IF('1_共通入力シート【記載必須】'!AG$7=\"\",\"\",'1_共通入力シート【記載必須】'!AG$7)","v":"22\n（R6年）"},{"$f":"IF('1_共通入力シート【記載必須】'!AH$7=\"\",\"\",'1_共通入力シート【記載必須】'!AH$7)","v":"婚姻率"},{"$f":"IF('1_共通入力シート【記載必須】'!AI$7=\"\",\"\",'1_共通入力シート【記載必須】'!AI$7)","v":""},{"$f":"IF('1_共通入力シート【記載必須】'!AJ$7=\"\",\"\",'1_共通入力シート【記載必須】'!AJ$7)","v":"4.27\n（R6年）"},null,null,null,null,null,null,null,null,null,null,null,null,null,null,null,null,null,null,null,null,"交付金事業に対する事業対象者（住民等）の満足度\n\n※該当事業のみ必須","％",null,null,"希望どおりの結婚に向けて後押ししてくれたと感じた人の割合\n\n※該当事業のみ必須","％",null,null,"結婚、妊娠・出産、子育てに前向きになったと感じた人の割合\n\n※該当事業のみ必須","％",null,null,null,null,null,null,null,null,null,null,null,null,null,null,null,null,null,null,null,null,null,null,null,null,null,"NG",null,"NG",null,"NG",null,"NG",null,"NG",null,"NG",null,"NG","OK",{"$f":"IFERROR(VLOOKUP($L13,リンク先!$E$147:$M$157,2,FALSE)&\"\",\"\")","v":""},null,"OK",{"$f":"IFERROR(VLOOKUP($L13,リンク先!$E$147:$M$157,3,FALSE)&\"\",\"\")","v":""},null,"OK",{"$f":"IFERROR(VLOOKUP($L13,リンク先!$E$147:$M$157,4,FALSE)&\"\",\"\")","v":""},null,"OK",null,null,"",{"$f":"IF(I13=リンク先!$C$12,4,VLOOKUP('1_共通入力シート【記載必須】'!$B$7,補助率判定!$B:$I,8,0))","v":2}]
[null,"⑧",{"$f":"'1_共通入力シート【記載必須】'!$B$7","v":"433641"},{"$f":"'1_共通入力シート【記載必須】'!$C$7","v":"市町村"},{"$f":"'1_共通入力シート【記載必須】'!$D$7","v":"熊本県"},{"$f":"'1_共通入力シート【記載必須】'!$E$7","v":"玉東町"},{"$f":"'1_共通入力シート【記載必須】'!$F$7","v":"熊本県玉東町"},null,null,null,null,null,null,{"$f":"IFERROR(VLOOKUP(GK14,リンク先!$F$3:$J$9,1+GL14,0),\"\")","v":""},{"$f":"AZ14","v":0},null,{"$f":"BA14","v":0},{"$f":"O14-P14","v":0},null,0,null,null,0,null,null,0,null,null,0,null,null,0,null,null,0,null,null,0,null,null,0,null,null,0,null,null,0,null,null,null,null,0,0,0,null,null,null,null,{"$f":"DATEVALUE(BF14&\"年12月31日\")","v":{"$error":"#VALUE!"}},2026,{"$f":"'1_共通入力シート【記載必須】'!$G$7","v":"　結婚・妊娠・共育ての相談機会提供・支援プログラムを実施し、結婚に伴う新生活を経済的に支援するため新生活費用に対して補助を行う。\n　また、荒尾・玉名地域結婚サポートセンター（有明広域行政事務組合）と連携して婚活事業を実施し、出会いの場の創出を重点的に行う。事業実施後には、対象者にアンケート調査等を行い、次年度以降により効果的な取組を行えるように留意する。"},null,null,null,null,null,null,null,null,null,null,null,null,null,null,null,null,null,null,null,null,null,null,{"$f":"IF('1_共通入力シート【記載必須】'!H$7=\"\",\"\",'1_共通入力シート【記載必須】'!H$7)","v":"荒尾・玉名地域結婚サポートセンター新規会員数"},{"$f":"IF('1_共通入力シート【記載必須】'!I$7=\"\",\"\",'1_共通入力シート【記載必須】'!I$7)","v":"人"},{"$f":"IF('1_共通入力シート【記載必須】'!J$7=\"\",\"\",'1_共通入力シート【記載必須】'!J$7)","v":"1\n（R7年度～R11年度）"},{"$f":"IF('1_共通入力シート【記載必須】'!K$7=\"\",\"\",'1_共通入力シート【記載必須】'!K$7)","v":"0\n（R6年度\n1月時点）"},{"$f":"IF('1_共通入力シート【記載必須】'!L$7=\"\",\"\",'1_共通入力シート【記載必須】'!L$7)","v":"不妊治療補助件数"},{"$f":"IF('1_共通入力シート【記載必須】'!M$7=\"\",\"\",'1_共通入力シート【記載必須】'!M$7)","v":"件"},{"$f":"IF('1_共通入力シート【記載必須】'!N$7=\"\",\"\",'1_共通入力シート【記載必須】'!N$7)","v":"5\n（R7年度～R11年度）"},{"$f":"IF('1_共通入力シート【記載必須】'!O$7=\"\",\"\",'1_共通入力シート【記載必須】'!O$7)","v":"3\n（R6.4～R7.2）"},{"$f":"IF('1_共通入力シート【記載必須】'!P$7=\"\",\"\",'1_共通入力シート【記載必須】'!P$7)","v":"子育て関連講座参加者数"},{"$f":"IF('1_共通入力シート【記載必須】'!Q$7=\"\",\"\",'1_共通入力シート【記載必須】'!Q$7)","v":"人"},{"$f":"IF('1_共通入力シート【記載必須】'!R$7=\"\",\"\",'1_共通入力シート【記載必須】'!R$7)","v":"488\n（R7年度～R11年度）"},{"$f":"IF('1_共通入力シート【記載必須】'!S$7=\"\",\"\",'1_共通入力シート【記載必須】'!S$7)","v":"487\n（R6.4～R7.1）"},{"$f":"IF('1_共通入力シート【記載必須】'!T$7=\"\",\"\",'1_共通入力シート【記載必須】'!T$7)","v":"こども家庭センターにおける相談支援件数"},{"$f":"IF('1_共通入力シート【記載必須】'!U$7=\"\",\"\",'1_共通入力シート【記載必須】'!U$7)","v":"件"},{"$f":"IF('1_共通入力シート【記載必須】'!V$7=\"\",\"\",'1_共通入力シート【記載必須】'!V$7)","v":"60/年\n（R7年度～R11年度）"},{"$f":"IF('1_共通入力シート【記載必須】'!W$7=\"\",\"\",'1_共通入力シート【記載必須】'!W$7)","v":"47/年\n（R6.4～R7.1）"},{"$f":"IF('1_共通入力シート【記載必須】'!X$7=\"\",\"\",'1_共通入力シート【記載必須】'!X$7)","v":""},{"$f":"IF('1_共通入力シート【記載必須】'!Y$7=\"\",\"\",'1_共通入力シート【記載必須】'!Y$7)","v":""},{"$f":"IF('1_共通入力シート【記載必須】'!Z$7=\"\",\"\",'1_共通入力シート【記載必須】'!Z$7)","v":""},{"$f":"IF('1_共通入力シート【記載必須】'!AA$7=\"\",\"\",'1_共通入力シート【記載必須】'!AA$7)","v":""},{"$f":"IF('1_共通入力シート【記載必須】'!AB$7=\"\",\"\",'1_共通入力シート【記載必須】'!AB$7)","v":"合計特殊出生率"},{"$f":"IF('1_共通入力シート【記載必須】'!AC$7=\"\",\"\",'1_共通入力シート【記載必須】'!AC$7)","v":""},{"$f":"IF('1_共通入力シート【記載必須】'!AD$7=\"\",\"\",'1_共通入力シート【記載必須】'!AD$7)","v":"2.44\n（R6年）"},{"$f":"IF('1_共通入力シート【記載必須】'!AE$7=\"\",\"\",'1_共通入力シート【記載必須】'!AE$7)","v":"婚姻件数"},{"$f":"IF('1_共通入力シート【記載必須】'!AF$7=\"\",\"\",'1_共通入力シート【記載必須】'!AF$7)","v":"件"},{"$f":"IF('1_共通入力シート【記載必須】'!AG$7=\"\",\"\",'1_共通入力シート【記載必須】'!AG$7)","v":"22\n（R6年）"},{"$f":"IF('1_共通入力シート【記載必須】'!AH$7=\"\",\"\",'1_共通入力シート【記載必須】'!AH$7)","v":"婚姻率"},{"$f":"IF('1_共通入力シート【記載必須】'!AI$7=\"\",\"\",'1_共通入力シート【記載必須】'!AI$7)","v":""},{"$f":"IF('1_共通入力シート【記載必須】'!AJ$7=\"\",\"\",'1_共通入力シート【記載必須】'!AJ$7)","v":"4.27\n（R6年）"},null,null,null,null,null,null,null,null,null,null,null,null,null,null,null,null,null,null,null,null,"交付金事業に対する事業対象者（住民等）の満足度\n\n※該当事業のみ必須","％",null,null,"希望どおりの結婚に向けて後押ししてくれたと感じた人の割合\n\n※該当事業のみ必須","％",null,null,"結婚、妊娠・出産、子育てに前向きになったと感じた人の割合\n\n※該当事業のみ必須","％",null,null,null,null,null,null,null,null,null,null,null,null,null,null,null,null,null,null,null,null,null,null,null,null,null,"NG",null,{"$f":"IF(FM14=\"含まれていない\",\"OK\",\"NG\")","v":"NG"},null,"NG",null,{"$f":"IF(FQ14=\"含まれていない\",\"OK\",\"NG\")","v":"NG"},null,{"$f":"IF(FS14=\"含まれていない\",\"OK\",\"NG\")","v":"NG"},null,"NG",null,{"$f":"IF(FW14=\"含まれていない\",\"OK\",\"NG\")","v":"NG"},"OK",{"$f":"IFERROR(VLOOKUP($L14,リンク先!$E$147:$M$157,2,FALSE)&\"\",\"\")","v":""},null,{"$f":"IF(OR(GA14=\"○\",FZ14=\"\"),\"OK\",\"NG\")","v":"OK"},{"$f":"IFERROR(VLOOKUP($L14,リンク先!$E$147:$M$157,3,FALSE)&\"\",\"\")","v":""},null,{"$f":"IF(OR(GD14=\"○\",GC14=\"\"),\"OK\",\"NG\")","v":"OK"},{"$f":"IFERROR(VLOOKUP($L14,リンク先!$E$147:$M$157,4,FALSE)&\"\",\"\")","v":""},null,{"$f":"IF(OR(GG14=\"○\",GF14=\"\"),\"OK\",\"NG\")","v":"OK"},null,null,"",{"$f":"IF(I14=リンク先!$C$12,4,VLOOKUP('1_共通入力シート【記載必須】'!$B$7,補助率判定!$B:$I,8,0))","v":2}]
[null,"⑨",{"$f":"'1_共通入力シート【記載必須】'!$B$7","v":"433641"},{"$f":"'1_共通入力シート【記載必須】'!$C$7","v":"市町村"},{"$f":"'1_共通入力シート【記載必須】'!$D$7","v":"熊本県"},{"$f":"'1_共通入力シート【記載必須】'!$E$7","v":"玉東町"},{"$f":"'1_共通入力シート【記載必須】'!$F$7","v":"熊本県玉東町"},null,null,null,null,null,null,{"$f":"IFERROR(VLOOKUP(GK15,リンク先!$F$3:$J$9,1+GL15,0),\"\")","v":""},0,null,0,0,null,0,null,null,0,null,null,0,null,null,0,null,null,0,null,null,0,null,null,0,null,null,0,null,null,0,null,null,0,null,null,null,null,0,0,0,null,null,null,null,{"$error":"#VALUE!"},2026,{"$f":"'1_共通入力シート【記載必須】'!$G$7","v":"　結婚・妊娠・共育ての相談機会提供・支援プログラムを実施し、結婚に伴う新生活を経済的に支援するため新生活費用に対して補助を行う。\n　また、荒尾・玉名地域結婚サポートセンター（有明広域行政事務組合）と連携して婚活事業を実施し、出会いの場の創出を重点的に行う。事業実施後には、対象者にアンケート調査等を行い、次年度以降により効果的な取組を行えるように留意する。"},null,null,null,null,null,null,null,null,null,null,null,null,null,null,null,null,null,null,null,null,null,null,{"$f":"IF('1_共通入力シート【記載必須】'!H$7=\"\",\"\",'1_共通入力シート【記載必須】'!H$7)","v":"荒尾・玉名地域結婚サポートセンター新規会員数"},{"$f":"IF('1_共通入力シート【記載必須】'!I$7=\"\",\"\",'1_共通入力シート【記載必須】'!I$7)","v":"人"},{"$f":"IF('1_共通入力シート【記載必須】'!J$7=\"\",\"\",'1_共通入力シート【記載必須】'!J$7)","v":"1\n（R7年度～R11年度）"},{"$f":"IF('1_共通入力シート【記載必須】'!K$7=\"\",\"\",'1_共通入力シート【記載必須】'!K$7)","v":"0\n（R6年度\n1月時点）"},{"$f":"IF('1_共通入力シート【記載必須】'!L$7=\"\",\"\",'1_共通入力シート【記載必須】'!L$7)","v":"不妊治療補助件数"},{"$f":"IF('1_共通入力シート【記載必須】'!M$7=\"\",\"\",'1_共通入力シート【記載必須】'!M$7)","v":"件"},{"$f":"IF('1_共通入力シート【記載必須】'!N$7=\"\",\"\",'1_共通入力シート【記載必須】'!N$7)","v":"5\n（R7年度～R11年度）"},{"$f":"IF('1_共通入力シート【記載必須】'!O$7=\"\",\"\",'1_共通入力シート【記載必須】'!O$7)","v":"3\n（R6.4～R7.2）"},{"$f":"IF('1_共通入力シート【記載必須】'!P$7=\"\",\"\",'1_共通入力シート【記載必須】'!P$7)","v":"子育て関連講座参加者数"},{"$f":"IF('1_共通入力シート【記載必須】'!Q$7=\"\",\"\",'1_共通入力シート【記載必須】'!Q$7)","v":"人"},{"$f":"IF('1_共通入力シート【記載必須】'!R$7=\"\",\"\",'1_共通入力シート【記載必須】'!R$7)","v":"488\n（R7年度～R11年度）"},{"$f":"IF('1_共通入力シート【記載必須】'!S$7=\"\",\"\",'1_共通入力シート【記載必須】'!S$7)","v":"487\n（R6.4～R7.1）"},{"$f":"IF('1_共通入力シート【記載必須】'!T$7=\"\",\"\",'1_共通入力シート【記載必須】'!T$7)","v":"こども家庭センターにおける相談支援件数"},{"$f":"IF('1_共通入力シート【記載必須】'!U$7=\"\",\"\",'1_共通入力シート【記載必須】'!U$7)","v":"件"},{"$f":"IF('1_共通入力シート【記載必須】'!V$7=\"\",\"\",'1_共通入力シート【記載必須】'!V$7)","v":"60/年\n（R7年度～R11年度）"},{"$f":"IF('1_共通入力シート【記載必須】'!W$7=\"\",\"\",'1_共通入力シート【記載必須】'!W$7)","v":"47/年\n（R6.4～R7.1）"},{"$f":"IF('1_共通入力シート【記載必須】'!X$7=\"\",\"\",'1_共通入力シート【記載必須】'!X$7)","v":""},{"$f":"IF('1_共通入力シート【記載必須】'!Y$7=\"\",\"\",'1_共通入力シート【記載必須】'!Y$7)","v":""},{"$f":"IF('1_共通入力シート【記載必須】'!Z$7=\"\",\"\",'1_共通入力シート【記載必須】'!Z$7)","v":""},{"$f":"IF('1_共通入力シート【記載必須】'!AA$7=\"\",\"\",'1_共通入力シート【記載必須】'!AA$7)","v":""},{"$f":"IF('1_共通入力シート【記載必須】'!AB$7=\"\",\"\",'1_共通入力シート【記載必須】'!AB$7)","v":"合計特殊出生率"},{"$f":"IF('1_共通入力シート【記載必須】'!AC$7=\"\",\"\",'1_共通入力シート【記載必須】'!AC$7)","v":""},{"$f":"IF('1_共通入力シート【記載必須】'!AD$7=\"\",\"\",'1_共通入力シート【記載必須】'!AD$7)","v":"2.44\n（R6年）"},{"$f":"IF('1_共通入力シート【記載必須】'!AE$7=\"\",\"\",'1_共通入力シート【記載必須】'!AE$7)","v":"婚姻件数"},{"$f":"IF('1_共通入力シート【記載必須】'!AF$7=\"\",\"\",'1_共通入力シート【記載必須】'!AF$7)","v":"件"},{"$f":"IF('1_共通入力シート【記載必須】'!AG$7=\"\",\"\",'1_共通入力シート【記載必須】'!AG$7)","v":"22\n（R6年）"},{"$f":"IF('1_共通入力シート【記載必須】'!AH$7=\"\",\"\",'1_共通入力シート【記載必須】'!AH$7)","v":"婚姻率"},{"$f":"IF('1_共通入力シート【記載必須】'!AI$7=\"\",\"\",'1_共通入力シート【記載必須】'!AI$7)","v":""},{"$f":"IF('1_共通入力シート【記載必須】'!AJ$7=\"\",\"\",'1_共通入力シート【記載必須】'!AJ$7)","v":"4.27\n（R6年）"},null,null,null,null,null,null,null,null,null,null,null,null,null,null,null,null,null,null,null,null,"交付金事業に対する事業対象者（住民等）の満足度\n\n※該当事業のみ必須","％",null,null,"希望どおりの結婚に向けて後押ししてくれたと感じた人の割合\n\n※該当事業のみ必須","％",null,null,"結婚、妊娠・出産、子育てに前向きになったと感じた人の割合\n\n※該当事業のみ必須","％",null,null,null,null,null,null,null,null,null,null,null,null,null,null,null,null,null,null,null,null,null,null,null,null,null,"NG",null,"NG",null,"NG",null,"NG",null,"NG",null,"NG",null,"NG","OK",{"$f":"IFERROR(VLOOKUP($L15,リンク先!$E$147:$M$157,2,FALSE)&\"\",\"\")","v":""},null,"OK",{"$f":"IFERROR(VLOOKUP($L15,リンク先!$E$147:$M$157,3,FALSE)&\"\",\"\")","v":""},null,"OK",{"$f":"IFERROR(VLOOKUP($L15,リンク先!$E$147:$M$157,4,FALSE)&\"\",\"\")","v":""},null,"OK",null,null,"",{"$f":"IF(I15=リンク先!$C$12,4,VLOOKUP('1_共通入力シート【記載必須】'!$B$7,補助率判定!$B:$I,8,0))","v":2}]
[null,"⑩",{"$f":"'1_共通入力シート【記載必須】'!$B$7","v":"433641"},{"$f":"'1_共通入力シート【記載必須】'!$C$7","v":"市町村"},{"$f":"'1_共通入力シート【記載必須】'!$D$7","v":"熊本県"},{"$f":"'1_共通入力シート【記載必須】'!$E$7","v":"玉東町"},{"$f":"'1_共通入力シート【記載必須】'!$F$7","v":"熊本県玉東町"},null,null,null,null,null,null,{"$f":"IFERROR(VLOOKUP(GK16,リンク先!$F$3:$J$9,1+GL16,0),\"\")","v":""},0,null,0,0,null,0,null,null,0,null,null,0,null,null,0,null,null,0,null,null,0,null,null,0,null,null,0,null,null,0,null,null,0,null,null,null,null,0,0,0,null,null,null,null,{"$error":"#VALUE!"},2026,{"$f":"'1_共通入力シート【記載必須】'!$G$7","v":"　結婚・妊娠・共育ての相談機会提供・支援プログラムを実施し、結婚に伴う新生活を経済的に支援するため新生活費用に対して補助を行う。\n　また、荒尾・玉名地域結婚サポートセンター（有明広域行政事務組合）と連携して婚活事業を実施し、出会いの場の創出を重点的に行う。事業実施後には、対象者にアンケート調査等を行い、次年度以降により効果的な取組を行えるように留意する。"},null,null,null,null,null,null,null,null,null,null,null,null,null,null,null,null,null,null,null,null,null,null,{"$f":"IF('1_共通入力シート【記載必須】'!H$7=\"\",\"\",'1_共通入力シート【記載必須】'!H$7)","v":"荒尾・玉名地域結婚サポートセンター新規会員数"},{"$f":"IF('1_共通入力シート【記載必須】'!I$7=\"\",\"\",'1_共通入力シート【記載必須】'!I$7)","v":"人"},{"$f":"IF('1_共通入力シート【記載必須】'!J$7=\"\",\"\",'1_共通入力シート【記載必須】'!J$7)","v":"1\n（R7年度～R11年度）"},{"$f":"IF('1_共通入力シート【記載必須】'!K$7=\"\",\"\",'1_共通入力シート【記載必須】'!K$7)","v":"0\n（R6年度\n1月時点）"},{"$f":"IF('1_共通入力シート【記載必須】'!L$7=\"\",\"\",'1_共通入力シート【記載必須】'!L$7)","v":"不妊治療補助件数"},{"$f":"IF('1_共通入力シート【記載必須】'!M$7=\"\",\"\",'1_共通入力シート【記載必須】'!M$7)","v":"件"},{"$f":"IF('1_共通入力シート【記載必須】'!N$7=\"\",\"\",'1_共通入力シート【記載必須】'!N$7)","v":"5\n（R7年度～R11年度）"},{"$f":"IF('1_共通入力シート【記載必須】'!O$7=\"\",\"\",'1_共通入力シート【記載必須】'!O$7)","v":"3\n（R6.4～R7.2）"},{"$f":"IF('1_共通入力シート【記載必須】'!P$7=\"\",\"\",'1_共通入力シート【記載必須】'!P$7)","v":"子育て関連講座参加者数"},{"$f":"IF('1_共通入力シート【記載必須】'!Q$7=\"\",\"\",'1_共通入力シート【記載必須】'!Q$7)","v":"人"},{"$f":"IF('1_共通入力シート【記載必須】'!R$7=\"\",\"\",'1_共通入力シート【記載必須】'!R$7)","v":"488\n（R7年度～R11年度）"},{"$f":"IF('1_共通入力シート【記載必須】'!S$7=\"\",\"\",'1_共通入力シート【記載必須】'!S$7)","v":"487\n（R6.4～R7.1）"},{"$f":"IF('1_共通入力シート【記載必須】'!T$7=\"\",\"\",'1_共通入力シート【記載必須】'!T$7)","v":"こども家庭センターにおける相談支援件数"},{"$f":"IF('1_共通入力シート【記載必須】'!U$7=\"\",\"\",'1_共通入力シート【記載必須】'!U$7)","v":"件"},{"$f":"IF('1_共通入力シート【記載必須】'!V$7=\"\",\"\",'1_共通入力シート【記載必須】'!V$7)","v":"60/年\n（R7年度～R11年度）"},{"$f":"IF('1_共通入力シート【記載必須】'!W$7=\"\",\"\",'1_共通入力シート【記載必須】'!W$7)","v":"47/年\n（R6.4～R7.1）"},{"$f":"IF('1_共通入力シート【記載必須】'!X$7=\"\",\"\",'1_共通入力シート【記載必須】'!X$7)","v":""},{"$f":"IF('1_共通入力シート【記載必須】'!Y$7=\"\",\"\",'1_共通入力シート【記載必須】'!Y$7)","v":""},{"$f":"IF('1_共通入力シート【記載必須】'!Z$7=\"\",\"\",'1_共通入力シート【記載必須】'!Z$7)","v":""},{"$f":"IF('1_共通入力シート【記載必須】'!AA$7=\"\",\"\",'1_共通入力シート【記載必須】'!AA$7)","v":""},{"$f":"IF('1_共通入力シート【記載必須】'!AB$7=\"\",\"\",'1_共通入力シート【記載必須】'!AB$7)","v":"合計特殊出生率"},{"$f":"IF('1_共通入力シート【記載必須】'!AC$7=\"\",\"\",'1_共通入力シート【記載必須】'!AC$7)","v":""},{"$f":"IF('1_共通入力シート【記載必須】'!AD$7=\"\",\"\",'1_共通入力シート【記載必須】'!AD$7)","v":"2.44\n（R6年）"},{"$f":"IF('1_共通入力シート【記載必須】'!AE$7=\"\",\"\",'1_共通入力シート【記載必須】'!AE$7)","v":"婚姻件数"},{"$f":"IF('1_共通入力シート【記載必須】'!AF$7=\"\",\"\",'1_共通入力シート【記載必須】'!AF$7)","v":"件"},{"$f":"IF('1_共通入力シート【記載必須】'!AG$7=\"\",\"\",'1_共通入力シート【記載必須】'!AG$7)","v":"22\n（R6年）"},{"$f":"IF('1_共通入力シート【記載必須】'!AH$7=\"\",\"\",'1_共通入力シート【記載必須】'!AH$7)","v":"婚姻率"},{"$f":"IF('1_共通入力シート【記載必須】'!AI$7=\"\",\"\",'1_共通入力シート【記載必須】'!AI$7)","v":""},{"$f":"IF('1_共通入力シート【記載必須】'!AJ$7=\"\",\"\",'1_共通入力シート【記載必須】'!AJ$7)","v":"4.27\n（R6年）"},null,null,null,null,null,null,null,null,null,null,null,null,null,null,null,null,null,null,null,null,"交付金事業に対する事業対象者（住民等）の満足度\n\n※該当事業のみ必須","％",null,null,"希望どおりの結婚に向けて後押ししてくれたと感じた人の割合\n\n※該当事業のみ必須","％",null,null,"結婚、妊娠・出産、子育てに前向きになったと感じた人の割合\n\n※該当事業のみ必須","％",null,null,null,null,null,null,null,null,null,null,null,null,null,null,null,null,null,null,null,null,null,null,null,null,null,"NG",null,"NG",null,"NG",null,"NG",null,"NG",null,"NG",null,"NG","OK",{"$f":"IFERROR(VLOOKUP($L16,リンク先!$E$147:$M$157,2,FALSE)&\"\",\"\")","v":""},null,"OK",{"$f":"IFERROR(VLOOKUP($L16,リンク先!$E$147:$M$157,3,FALSE)&\"\",\"\")","v":""},null,"OK",{"$f":"IFERROR(VLOOKUP($L16,リンク先!$E$147:$M$157,4,FALSE)&\"\",\"\")","v":""},null,"OK",null,null,"",{"$f":"IF(I16=リンク先!$C$12,4,VLOOKUP('1_共通入力シート【記載必須】'!$B$7,補助率判定!$B:$I,8,0))","v":2}]
[null,"⑪",{"$f":"'1_共通入力シート【記載必須】'!$B$7","v":"433641"},{"$f":"'1_共通入力シート【記載必須】'!$C$7","v":"市町村"},{"$f":"'1_共通入力シート【記載必須】'!$D$7","v":"熊本県"},{"$f":"'1_共通入力シート【記載必須】'!$E$7","v":"玉東町"},{"$f":"'1_共通入力シート【記載必須】'!$F$7","v":"熊本県玉東町"},null,null,null,null,null,null,{"$f":"IFERROR(VLOOKUP(GK17,リンク先!$F$3:$J$9,1+GL17,0),\"\")","v":""},0,null,0,0,null,0,null,null,0,null,null,0,null,null,0,null,null,0,null,null,0,null,null,0,null,null,0,null,null,0,null,null,0,null,null,null,null,0,0,0,null,null,null,null,{"$error":"#VALUE!"},2026,{"$f":"'1_共通入力シート【記載必須】'!$G$7","v":"　結婚・妊娠・共育ての相談機会提供・支援プログラムを実施し、結婚に伴う新生活を経済的に支援するため新生活費用に対して補助を行う。\n　また、荒尾・玉名地域結婚サポートセンター（有明広域行政事務組合）と連携して婚活事業を実施し、出会いの場の創出を重点的に行う。事業実施後には、対象者にアンケート調査等を行い、次年度以降により効果的な取組を行えるように留意する。"},null,null,null,null,null,null,null,null,null,null,null,null,null,null,null,null,null,null,null,null,null,null,{"$f":"IF('1_共通入力シート【記載必須】'!H$7=\"\",\"\",'1_共通入力シート【記載必須】'!H$7)","v":"荒尾・玉名地域結婚サポートセンター新規会員数"},{"$f":"IF('1_共通入力シート【記載必須】'!I$7=\"\",\"\",'1_共通入力シート【記載必須】'!I$7)","v":"人"},{"$f":"IF('1_共通入力シート【記載必須】'!J$7=\"\",\"\",'1_共通入力シート【記載必須】'!J$7)","v":"1\n（R7年度～R11年度）"},{"$f":"IF('1_共通入力シート【記載必須】'!K$7=\"\",\"\",'1_共通入力シート【記載必須】'!K$7)","v":"0\n（R6年度\n1月時点）"},{"$f":"IF('1_共通入力シート【記載必須】'!L$7=\"\",\"\",'1_共通入力シート【記載必須】'!L$7)","v":"不妊治療補助件数"},{"$f":"IF('1_共通入力シート【記載必須】'!M$7=\"\",\"\",'1_共通入力シート【記載必須】'!M$7)","v":"件"},{"$f":"IF('1_共通入力シート【記載必須】'!N$7=\"\",\"\",'1_共通入力シート【記載必須】'!N$7)","v":"5\n（R7年度～R11年度）"},{"$f":"IF('1_共通入力シート【記載必須】'!O$7=\"\",\"\",'1_共通入力シート【記載必須】'!O$7)","v":"3\n（R6.4～R7.2）"},{"$f":"IF('1_共通入力シート【記載必須】'!P$7=\"\",\"\",'1_共通入力シート【記載必須】'!P$7)","v":"子育て関連講座参加者数"},{"$f":"IF('1_共通入力シート【記載必須】'!Q$7=\"\",\"\",'1_共通入力シート【記載必須】'!Q$7)","v":"人"},{"$f":"IF('1_共通入力シート【記載必須】'!R$7=\"\",\"\",'1_共通入力シート【記載必須】'!R$7)","v":"488\n（R7年度～R11年度）"},{"$f":"IF('1_共通入力シート【記載必須】'!S$7=\"\",\"\",'1_共通入力シート【記載必須】'!S$7)","v":"487\n（R6.4～R7.1）"},{"$f":"IF('1_共通入力シート【記載必須】'!T$7=\"\",\"\",'1_共通入力シート【記載必須】'!T$7)","v":"こども家庭センターにおける相談支援件数"},{"$f":"IF('1_共通入力シート【記載必須】'!U$7=\"\",\"\",'1_共通入力シート【記載必須】'!U$7)","v":"件"},{"$f":"IF('1_共通入力シート【記載必須】'!V$7=\"\",\"\",'1_共通入力シート【記載必須】'!V$7)","v":"60/年\n（R7年度～R11年度）"},{"$f":"IF('1_共通入力シート【記載必須】'!W$7=\"\",\"\",'1_共通入力シート【記載必須】'!W$7)","v":"47/年\n（R6.4～R7.1）"},{"$f":"IF('1_共通入力シート【記載必須】'!X$7=\"\",\"\",'1_共通入力シート【記載必須】'!X$7)","v":""},{"$f":"IF('1_共通入力シート【記載必須】'!Y$7=\"\",\"\",'1_共通入力シート【記載必須】'!Y$7)","v":""},{"$f":"IF('1_共通入力シート【記載必須】'!Z$7=\"\",\"\",'1_共通入力シート【記載必須】'!Z$7)","v":""},{"$f":"IF('1_共通入力シート【記載必須】'!AA$7=\"\",\"\",'1_共通入力シート【記載必須】'!AA$7)","v":""},{"$f":"IF('1_共通入力シート【記載必須】'!AB$7=\"\",\"\",'1_共通入力シート【記載必須】'!AB$7)","v":"合計特殊出生率"},{"$f":"IF('1_共通入力シート【記載必須】'!AC$7=\"\",\"\",'1_共通入力シート【記載必須】'!AC$7)","v":""},{"$f":"IF('1_共通入力シート【記載必須】'!AD$7=\"\",\"\",'1_共通入力シート【記載必須】'!AD$7)","v":"2.44\n（R6年）"},{"$f":"IF('1_共通入力シート【記載必須】'!AE$7=\"\",\"\",'1_共通入力シート【記載必須】'!AE$7)","v":"婚姻件数"},{"$f":"IF('1_共通入力シート【記載必須】'!AF$7=\"\",\"\",'1_共通入力シート【記載必須】'!AF$7)","v":"件"},{"$f":"IF('1_共通入力シート【記載必須】'!AG$7=\"\",\"\",'1_共通入力シート【記載必須】'!AG$7)","v":"22\n（R6年）"},{"$f":"IF('1_共通入力シート【記載必須】'!AH$7=\"\",\"\",'1_共通入力シート【記載必須】'!AH$7)","v":"婚姻率"},{"$f":"IF('1_共通入力シート【記載必須】'!AI$7=\"\",\"\",'1_共通入力シート【記載必須】'!AI$7)","v":""},{"$f":"IF('1_共通入力シート【記載必須】'!AJ$7=\"\",\"\",'1_共通入力シート【記載必須】'!AJ$7)","v":"4.27\n（R6年）"},null,null,null,null,null,null,null,null,null,null,null,null,null,null,null,null,null,null,null,null,"交付金事業に対する事業対象者（住民等）の満足度\n\n※該当事業のみ必須","％",null,null,"希望どおりの結婚に向けて後押ししてくれたと感じた人の割合\n\n※該当事業のみ必須","％",null,null,"結婚、妊娠・出産、子育てに前向きになったと感じた人の割合\n\n※該当事業のみ必須","％",null,null,null,null,null,null,null,null,null,null,null,null,null,null,null,null,null,null,null,null,null,null,null,null,null,"NG",null,"NG",null,"NG",null,"NG",null,"NG",null,"NG",null,"NG","OK",{"$f":"IFERROR(VLOOKUP($L17,リンク先!$E$147:$M$157,2,FALSE)&\"\",\"\")","v":""},null,"OK",{"$f":"IFERROR(VLOOKUP($L17,リンク先!$E$147:$M$157,3,FALSE)&\"\",\"\")","v":""},null,"OK",{"$f":"IFERROR(VLOOKUP($L17,リンク先!$E$147:$M$157,4,FALSE)&\"\",\"\")","v":""},null,"OK",null,null,"",{"$f":"IF(I17=リンク先!$C$12,4,VLOOKUP('1_共通入力シート【記載必須】'!$B$7,補助率判定!$B:$I,8,0))","v":2}]
[null,"⑫",{"$f":"'1_共通入力シート【記載必須】'!$B$7","v":"433641"},{"$f":"'1_共通入力シート【記載必須】'!$C$7","v":"市町村"},{"$f":"'1_共通入力シート【記載必須】'!$D$7","v":"熊本県"},{"$f":"'1_共通入力シート【記載必須】'!$E$7","v":"玉東町"},{"$f":"'1_共通入力シート【記載必須】'!$F$7","v":"熊本県玉東町"},null,null,null,null,null,null,{"$f":"IFERROR(VLOOKUP(GK18,リンク先!$F$3:$J$9,1+GL18,0),\"\")","v":""},0,null,0,0,null,0,null,null,0,null,null,0,null,null,0,null,null,0,null,null,0,null,null,0,null,null,0,null,null,0,null,null,0,null,null,null,null,0,0,0,null,null,null,null,{"$error":"#VALUE!"},2026,{"$f":"'1_共通入力シート【記載必須】'!$G$7","v":"　結婚・妊娠・共育ての相談機会提供・支援プログラムを実施し、結婚に伴う新生活を経済的に支援するため新生活費用に対して補助を行う。\n　また、荒尾・玉名地域結婚サポートセンター（有明広域行政事務組合）と連携して婚活事業を実施し、出会いの場の創出を重点的に行う。事業実施後には、対象者にアンケート調査等を行い、次年度以降により効果的な取組を行えるように留意する。"},null,null,null,null,null,null,null,null,null,null,null,null,null,null,null,null,null,null,null,null,null,null,{"$f":"IF('1_共通入力シート【記載必須】'!H$7=\"\",\"\",'1_共通入力シート【記載必須】'!H$7)","v":"荒尾・玉名地域結婚サポートセンター新規会員数"},{"$f":"IF('1_共通入力シート【記載必須】'!I$7=\"\",\"\",'1_共通入力シート【記載必須】'!I$7)","v":"人"},{"$f":"IF('1_共通入力シート【記載必須】'!J$7=\"\",\"\",'1_共通入力シート【記載必須】'!J$7)","v":"1\n（R7年度～R11年度）"},{"$f":"IF('1_共通入力シート【記載必須】'!K$7=\"\",\"\",'1_共通入力シート【記載必須】'!K$7)","v":"0\n（R6年度\n1月時点）"},{"$f":"IF('1_共通入力シート【記載必須】'!L$7=\"\",\"\",'1_共通入力シート【記載必須】'!L$7)","v":"不妊治療補助件数"},{"$f":"IF('1_共通入力シート【記載必須】'!M$7=\"\",\"\",'1_共通入力シート【記載必須】'!M$7)","v":"件"},{"$f":"IF('1_共通入力シート【記載必須】'!N$7=\"\",\"\",'1_共通入力シート【記載必須】'!N$7)","v":"5\n（R7年度～R11年度）"},{"$f":"IF('1_共通入力シート【記載必須】'!O$7=\"\",\"\",'1_共通入力シート【記載必須】'!O$7)","v":"3\n（R6.4～R7.2）"},{"$f":"IF('1_共通入力シート【記載必須】'!P$7=\"\",\"\",'1_共通入力シート【記載必須】'!P$7)","v":"子育て関連講座参加者数"},{"$f":"IF('1_共通入力シート【記載必須】'!Q$7=\"\",\"\",'1_共通入力シート【記載必須】'!Q$7)","v":"人"},{"$f":"IF('1_共通入力シート【記載必須】'!R$7=\"\",\"\",'1_共通入力シート【記載必須】'!R$7)","v":"488\n（R7年度～R11年度）"},{"$f":"IF('1_共通入力シート【記載必須】'!S$7=\"\",\"\",'1_共通入力シート【記載必須】'!S$7)","v":"487\n（R6.4～R7.1）"},{"$f":"IF('1_共通入力シート【記載必須】'!T$7=\"\",\"\",'1_共通入力シート【記載必須】'!T$7)","v":"こども家庭センターにおける相談支援件数"},{"$f":"IF('1_共通入力シート【記載必須】'!U$7=\"\",\"\",'1_共通入力シート【記載必須】'!U$7)","v":"件"},{"$f":"IF('1_共通入力シート【記載必須】'!V$7=\"\",\"\",'1_共通入力シート【記載必須】'!V$7)","v":"60/年\n（R7年度～R11年度）"},{"$f":"IF('1_共通入力シート【記載必須】'!W$7=\"\",\"\",'1_共通入力シート【記載必須】'!W$7)","v":"47/年\n（R6.4～R7.1）"},{"$f":"IF('1_共通入力シート【記載必須】'!X$7=\"\",\"\",'1_共通入力シート【記載必須】'!X$7)","v":""},{"$f":"IF('1_共通入力シート【記載必須】'!Y$7=\"\",\"\",'1_共通入力シート【記載必須】'!Y$7)","v":""},{"$f":"IF('1_共通入力シート【記載必須】'!Z$7=\"\",\"\",'1_共通入力シート【記載必須】'!Z$7)","v":""},{"$f":"IF('1_共通入力シート【記載必須】'!AA$7=\"\",\"\",'1_共通入力シート【記載必須】'!AA$7)","v":""},{"$f":"IF('1_共通入力シート【記載必須】'!AB$7=\"\",\"\",'1_共通入力シート【記載必須】'!AB$7)","v":"合計特殊出生率"},{"$f":"IF('1_共通入力シート【記載必須】'!AC$7=\"\",\"\",'1_共通入力シート【記載必須】'!AC$7)","v":""},{"$f":"IF('1_共通入力シート【記載必須】'!AD$7=\"\",\"\",'1_共通入力シート【記載必須】'!AD$7)","v":"2.44\n（R6年）"},{"$f":"IF('1_共通入力シート【記載必須】'!AE$7=\"\",\"\",'1_共通入力シート【記載必須】'!AE$7)","v":"婚姻件数"},{"$f":"IF('1_共通入力シート【記載必須】'!AF$7=\"\",\"\",'1_共通入力シート【記載必須】'!AF$7)","v":"件"},{"$f":"IF('1_共通入力シート【記載必須】'!AG$7=\"\",\"\",'1_共通入力シート【記載必須】'!AG$7)","v":"22\n（R6年）"},{"$f":"IF('1_共通入力シート【記載必須】'!AH$7=\"\",\"\",'1_共通入力シート【記載必須】'!AH$7)","v":"婚姻率"},{"$f":"IF('1_共通入力シート【記載必須】'!AI$7=\"\",\"\",'1_共通入力シート【記載必須】'!AI$7)","v":""},{"$f":"IF('1_共通入力シート【記載必須】'!AJ$7=\"\",\"\",'1_共通入力シート【記載必須】'!AJ$7)","v":"4.27\n（R6年）"},null,null,null,null,null,null,null,null,null,null,null,null,null,null,null,null,null,null,null,null,"交付金事業に対する事業対象者（住民等）の満足度\n\n※該当事業のみ必須","％",null,null,"希望どおりの結婚に向けて後押ししてくれたと感じた人の割合\n\n※該当事業のみ必須","％",null,null,"結婚、妊娠・出産、子育てに前向きになったと感じた人の割合\n\n※該当事業のみ必須","％",null,null,null,null,null,null,null,null,null,null,null,null,null,null,null,null,null,null,null,null,null,null,null,null,null,"NG",null,"NG",null,"NG",null,"NG",null,"NG",null,"NG",null,"NG","OK",{"$f":"IFERROR(VLOOKUP($L18,リンク先!$E$147:$M$157,2,FALSE)&\"\",\"\")","v":""},null,"OK",{"$f":"IFERROR(VLOOKUP($L18,リンク先!$E$147:$M$157,3,FALSE)&\"\",\"\")","v":""},null,"OK",{"$f":"IFERROR(VLOOKUP($L18,リンク先!$E$147:$M$157,4,FALSE)&\"\",\"\")","v":""},null,"OK",null,null,"",{"$f":"IF(I18=リンク先!$C$12,4,VLOOKUP('1_共通入力シート【記載必須】'!$B$7,補助率判定!$B:$I,8,0))","v":2}]
[null,"⑬",{"$f":"'1_共通入力シート【記載必須】'!$B$7","v":"433641"},{"$f":"'1_共通入力シート【記載必須】'!$C$7","v":"市町村"},{"$f":"'1_共通入力シート【記載必須】'!$D$7","v":"熊本県"},{"$f":"'1_共通入力シート【記載必須】'!$E$7","v":"玉東町"},{"$f":"'1_共通入力シート【記載必須】'!$F$7","v":"熊本県玉東町"},null,null,null,null,null,null,{"$f":"IFERROR(VLOOKUP(GK19,リンク先!$F$3:$J$9,1+GL19,0),\"\")","v":""},0,null,0,0,null,0,null,null,0,null,null,0,null,null,0,null,null,0,null,null,0,null,null,0,null,null,0,null,null,0,null,null,0,null,null,null,null,0,0,0,null,null,null,null,{"$error":"#VALUE!"},2026,{"$f":"'1_共通入力シート【記載必須】'!$G$7","v":"　結婚・妊娠・共育ての相談機会提供・支援プログラムを実施し、結婚に伴う新生活を経済的に支援するため新生活費用に対して補助を行う。\n　また、荒尾・玉名地域結婚サポートセンター（有明広域行政事務組合）と連携して婚活事業を実施し、出会いの場の創出を重点的に行う。事業実施後には、対象者にアンケート調査等を行い、次年度以降により効果的な取組を行えるように留意する。"},null,null,null,null,null,null,null,null,null,null,null,null,null,null,null,null,null,null,null,null,null,null,{"$f":"IF('1_共通入力シート【記載必須】'!H$7=\"\",\"\",'1_共通入力シート【記載必須】'!H$7)","v":"荒尾・玉名地域結婚サポートセンター新規会員数"},{"$f":"IF('1_共通入力シート【記載必須】'!I$7=\"\",\"\",'1_共通入力シート【記載必須】'!I$7)","v":"人"},{"$f":"IF('1_共通入力シート【記載必須】'!J$7=\"\",\"\",'1_共通入力シート【記載必須】'!J$7)","v":"1\n（R7年度～R11年度）"},{"$f":"IF('1_共通入力シート【記載必須】'!K$7=\"\",\"\",'1_共通入力シート【記載必須】'!K$7)","v":"0\n（R6年度\n1月時点）"},{"$f":"IF('1_共通入力シート【記載必須】'!L$7=\"\",\"\",'1_共通入力シート【記載必須】'!L$7)","v":"不妊治療補助件数"},{"$f":"IF('1_共通入力シート【記載必須】'!M$7=\"\",\"\",'1_共通入力シート【記載必須】'!M$7)","v":"件"},{"$f":"IF('1_共通入力シート【記載必須】'!N$7=\"\",\"\",'1_共通入力シート【記載必須】'!N$7)","v":"5\n（R7年度～R11年度）"},{"$f":"IF('1_共通入力シート【記載必須】'!O$7=\"\",\"\",'1_共通入力シート【記載必須】'!O$7)","v":"3\n（R6.4～R7.2）"},{"$f":"IF('1_共通入力シート【記載必須】'!P$7=\"\",\"\",'1_共通入力シート【記載必須】'!P$7)","v":"子育て関連講座参加者数"},{"$f":"IF('1_共通入力シート【記載必須】'!Q$7=\"\",\"\",'1_共通入力シート【記載必須】'!Q$7)","v":"人"},{"$f":"IF('1_共通入力シート【記載必須】'!R$7=\"\",\"\",'1_共通入力シート【記載必須】'!R$7)","v":"488\n（R7年度～R11年度）"},{"$f":"IF('1_共通入力シート【記載必須】'!S$7=\"\",\"\",'1_共通入力シート【記載必須】'!S$7)","v":"487\n（R6.4～R7.1）"},{"$f":"IF('1_共通入力シート【記載必須】'!T$7=\"\",\"\",'1_共通入力シート【記載必須】'!T$7)","v":"こども家庭センターにおける相談支援件数"},{"$f":"IF('1_共通入力シート【記載必須】'!U$7=\"\",\"\",'1_共通入力シート【記載必須】'!U$7)","v":"件"},{"$f":"IF('1_共通入力シート【記載必須】'!V$7=\"\",\"\",'1_共通入力シート【記載必須】'!V$7)","v":"60/年\n（R7年度～R11年度）"},{"$f":"IF('1_共通入力シート【記載必須】'!W$7=\"\",\"\",'1_共通入力シート【記載必須】'!W$7)","v":"47/年\n（R6.4～R7.1）"},{"$f":"IF('1_共通入力シート【記載必須】'!X$7=\"\",\"\",'1_共通入力シート【記載必須】'!X$7)","v":""},{"$f":"IF('1_共通入力シート【記載必須】'!Y$7=\"\",\"\",'1_共通入力シート【記載必須】'!Y$7)","v":""},{"$f":"IF('1_共通入力シート【記載必須】'!Z$7=\"\",\"\",'1_共通入力シート【記載必須】'!Z$7)","v":""},{"$f":"IF('1_共通入力シート【記載必須】'!AA$7=\"\",\"\",'1_共通入力シート【記載必須】'!AA$7)","v":""},{"$f":"IF('1_共通入力シート【記載必須】'!AB$7=\"\",\"\",'1_共通入力シート【記載必須】'!AB$7)","v":"合計特殊出生率"},{"$f":"IF('1_共通入力シート【記載必須】'!AC$7=\"\",\"\",'1_共通入力シート【記載必須】'!AC$7)","v":""},{"$f":"IF('1_共通入力シート【記載必須】'!AD$7=\"\",\"\",'1_共通入力シート【記載必須】'!AD$7)","v":"2.44\n（R6年）"},{"$f":"IF('1_共通入力シート【記載必須】'!AE$7=\"\",\"\",'1_共通入力シート【記載必須】'!AE$7)","v":"婚姻件数"},{"$f":"IF('1_共通入力シート【記載必須】'!AF$7=\"\",\"\",'1_共通入力シート【記載必須】'!AF$7)","v":"件"},{"$f":"IF('1_共通入力シート【記載必須】'!AG$7=\"\",\"\",'1_共通入力シート【記載必須】'!AG$7)","v":"22\n（R6年）"},{"$f":"IF('1_共通入力シート【記載必須】'!AH$7=\"\",\"\",'1_共通入力シート【記載必須】'!AH$7)","v":"婚姻率"},{"$f":"IF('1_共通入力シート【記載必須】'!AI$7=\"\",\"\",'1_共通入力シート【記載必須】'!AI$7)","v":""},{"$f":"IF('1_共通入力シート【記載必須】'!AJ$7=\"\",\"\",'1_共通入力シート【記載必須】'!AJ$7)","v":"4.27\n（R6年）"},null,null,null,null,null,null,null,null,null,null,null,null,null,null,null,null,null,null,null,null,"交付金事業に対する事業対象者（住民等）の満足度\n\n※該当事業のみ必須","％",null,null,"希望どおりの結婚に向けて後押ししてくれたと感じた人の割合\n\n※該当事業のみ必須","％",null,null,"結婚、妊娠・出産、子育てに前向きになったと感じた人の割合\n\n※該当事業のみ必須","％",null,null,null,null,null,null,null,null,null,null,null,null,null,null,null,null,null,null,null,null,null,null,null,null,null,"NG",null,"NG",null,"NG",null,"NG",null,"NG",null,"NG",null,"NG","OK",{"$f":"IFERROR(VLOOKUP($L19,リンク先!$E$147:$M$157,2,FALSE)&\"\",\"\")","v":""},null,"OK",{"$f":"IFERROR(VLOOKUP($L19,リンク先!$E$147:$M$157,3,FALSE)&\"\",\"\")","v":""},null,"OK",{"$f":"IFERROR(VLOOKUP($L19,リンク先!$E$147:$M$157,4,FALSE)&\"\",\"\")","v":""},null,"OK",null,null,"",{"$f":"IF(I19=リンク先!$C$12,4,VLOOKUP('1_共通入力シート【記載必須】'!$B$7,補助率判定!$B:$I,8,0))","v":2}]
[null,"⑭",{"$f":"'1_共通入力シート【記載必須】'!$B$7","v":"433641"},{"$f":"'1_共通入力シート【記載必須】'!$C$7","v":"市町村"},{"$f":"'1_共通入力シート【記載必須】'!$D$7","v":"熊本県"},{"$f":"'1_共通入力シート【記載必須】'!$E$7","v":"玉東町"},{"$f":"'1_共通入力シート【記載必須】'!$F$7","v":"熊本県玉東町"},null,null,null,null,null,null,{"$f":"IFERROR(VLOOKUP(GK20,リンク先!$F$3:$J$9,1+GL20,0),\"\")","v":""},0,null,0,0,null,0,null,null,0,null,null,0,null,null,0,null,null,0,null,null,0,null,null,0,null,null,0,null,null,0,null,null,0,null,null,null,null,0,0,0,null,null,null,null,{"$error":"#VALUE!"},2026,{"$f":"'1_共通入力シート【記載必須】'!$G$7","v":"　結婚・妊娠・共育ての相談機会提供・支援プログラムを実施し、結婚に伴う新生活を経済的に支援するため新生活費用に対して補助を行う。\n　また、荒尾・玉名地域結婚サポートセンター（有明広域行政事務組合）と連携して婚活事業を実施し、出会いの場の創出を重点的に行う。事業実施後には、対象者にアンケート調査等を行い、次年度以降により効果的な取組を行えるように留意する。"},null,null,null,null,null,null,null,null,null,null,null,null,null,null,null,null,null,null,null,null,null,null,{"$f":"IF('1_共通入力シート【記載必須】'!H$7=\"\",\"\",'1_共通入力シート【記載必須】'!H$7)","v":"荒尾・玉名地域結婚サポートセンター新規会員数"},{"$f":"IF('1_共通入力シート【記載必須】'!I$7=\"\",\"\",'1_共通入力シート【記載必須】'!I$7)","v":"人"},{"$f":"IF('1_共通入力シート【記載必須】'!J$7=\"\",\"\",'1_共通入力シート【記載必須】'!J$7)","v":"1\n（R7年度～R11年度）"},{"$f":"IF('1_共通入力シート【記載必須】'!K$7=\"\",\"\",'1_共通入力シート【記載必須】'!K$7)","v":"0\n（R6年度\n1月時点）"},{"$f":"IF('1_共通入力シート【記載必須】'!L$7=\"\",\"\",'1_共通入力シート【記載必須】'!L$7)","v":"不妊治療補助件数"},{"$f":"IF('1_共通入力シート【記載必須】'!M$7=\"\",\"\",'1_共通入力シート【記載必須】'!M$7)","v":"件"},{"$f":"IF('1_共通入力シート【記載必須】'!N$7=\"\",\"\",'1_共通入力シート【記載必須】'!N$7)","v":"5\n（R7年度～R11年度）"},{"$f":"IF('1_共通入力シート【記載必須】'!O$7=\"\",\"\",'1_共通入力シート【記載必須】'!O$7)","v":"3\n（R6.4～R7.2）"},{"$f":"IF('1_共通入力シート【記載必須】'!P$7=\"\",\"\",'1_共通入力シート【記載必須】'!P$7)","v":"子育て関連講座参加者数"},{"$f":"IF('1_共通入力シート【記載必須】'!Q$7=\"\",\"\",'1_共通入力シート【記載必須】'!Q$7)","v":"人"},{"$f":"IF('1_共通入力シート【記載必須】'!R$7=\"\",\"\",'1_共通入力シート【記載必須】'!R$7)","v":"488\n（R7年度～R11年度）"},{"$f":"IF('1_共通入力シート【記載必須】'!S$7=\"\",\"\",'1_共通入力シート【記載必須】'!S$7)","v":"487\n（R6.4～R7.1）"},{"$f":"IF('1_共通入力シート【記載必須】'!T$7=\"\",\"\",'1_共通入力シート【記載必須】'!T$7)","v":"こども家庭センターにおける相談支援件数"},{"$f":"IF('1_共通入力シート【記載必須】'!U$7=\"\",\"\",'1_共通入力シート【記載必須】'!U$7)","v":"件"},{"$f":"IF('1_共通入力シート【記載必須】'!V$7=\"\",\"\",'1_共通入力シート【記載必須】'!V$7)","v":"60/年\n（R7年度～R11年度）"},{"$f":"IF('1_共通入力シート【記載必須】'!W$7=\"\",\"\",'1_共通入力シート【記載必須】'!W$7)","v":"47/年\n（R6.4～R7.1）"},{"$f":"IF('1_共通入力シート【記載必須】'!X$7=\"\",\"\",'1_共通入力シート【記載必須】'!X$7)","v":""},{"$f":"IF('1_共通入力シート【記載必須】'!Y$7=\"\",\"\",'1_共通入力シート【記載必須】'!Y$7)","v":""},{"$f":"IF('1_共通入力シート【記載必須】'!Z$7=\"\",\"\",'1_共通入力シート【記載必須】'!Z$7)","v":""},{"$f":"IF('1_共通入力シート【記載必須】'!AA$7=\"\",\"\",'1_共通入力シート【記載必須】'!AA$7)","v":""},{"$f":"IF('1_共通入力シート【記載必須】'!AB$7=\"\",\"\",'1_共通入力シート【記載必須】'!AB$7)","v":"合計特殊出生率"},{"$f":"IF('1_共通入力シート【記載必須】'!AC$7=\"\",\"\",'1_共通入力シート【記載必須】'!AC$7)","v":""},{"$f":"IF('1_共通入力シート【記載必須】'!AD$7=\"\",\"\",'1_共通入力シート【記載必須】'!AD$7)","v":"2.44\n（R6年）"},{"$f":"IF('1_共通入力シート【記載必須】'!AE$7=\"\",\"\",'1_共通入力シート【記載必須】'!AE$7)","v":"婚姻件数"},{"$f":"IF('1_共通入力シート【記載必須】'!AF$7=\"\",\"\",'1_共通入力シート【記載必須】'!AF$7)","v":"件"},{"$f":"IF('1_共通入力シート【記載必須】'!AG$7=\"\",\"\",'1_共通入力シート【記載必須】'!AG$7)","v":"22\n（R6年）"},{"$f":"IF('1_共通入力シート【記載必須】'!AH$7=\"\",\"\",'1_共通入力シート【記載必須】'!AH$7)","v":"婚姻率"},{"$f":"IF('1_共通入力シート【記載必須】'!AI$7=\"\",\"\",'1_共通入力シート【記載必須】'!AI$7)","v":""},{"$f":"IF('1_共通入力シート【記載必須】'!AJ$7=\"\",\"\",'1_共通入力シート【記載必須】'!AJ$7)","v":"4.27\n（R6年）"},null,null,null,null,null,null,null,null,null,null,null,null,null,null,null,null,null,null,null,null,"交付金事業に対する事業対象者（住民等）の満足度\n\n※該当事業のみ必須","％",null,null,"希望どおりの結婚に向けて後押ししてくれたと感じた人の割合\n\n※該当事業のみ必須","％",null,null,"結婚、妊娠・出産、子育てに前向きになったと感じた人の割合\n\n※該当事業のみ必須","％",null,null,null,null,null,null,null,null,null,null,null,null,null,null,null,null,null,null,null,null,null,null,null,null,null,"NG",null,"NG",null,"NG",null,"NG",null,"NG",null,"NG",null,"NG","OK",{"$f":"IFERROR(VLOOKUP($L20,リンク先!$E$147:$M$157,2,FALSE)&\"\",\"\")","v":""},null,"OK",{"$f":"IFERROR(VLOOKUP($L20,リンク先!$E$147:$M$157,3,FALSE)&\"\",\"\")","v":""},null,"OK",{"$f":"IFERROR(VLOOKUP($L20,リンク先!$E$147:$M$157,4,FALSE)&\"\",\"\")","v":""},null,"OK",null,null,"",{"$f":"IF(I20=リンク先!$C$12,4,VLOOKUP('1_共通入力シート【記載必須】'!$B$7,補助率判定!$B:$I,8,0))","v":2}]
[null,"⑮",{"$f":"'1_共通入力シート【記載必須】'!$B$7","v":"433641"},{"$f":"'1_共通入力シート【記載必須】'!$C$7","v":"市町村"},{"$f":"'1_共通入力シート【記載必須】'!$D$7","v":"熊本県"},{"$f":"'1_共通入力シート【記載必須】'!$E$7","v":"玉東町"},{"$f":"'1_共通入力シート【記載必須】'!$F$7","v":"熊本県玉東町"},null,null,null,null,null,null,{"$f":"IFERROR(VLOOKUP(GK21,リンク先!$F$3:$J$9,1+GL21,0),\"\")","v":""},0,null,0,0,null,0,null,null,0,null,null,0,null,null,0,null,null,0,null,null,0,null,null,0,null,null,0,null,null,0,null,null,0,null,null,null,null,0,0,0,null,null,null,null,{"$error":"#VALUE!"},2026,{"$f":"'1_共通入力シート【記載必須】'!$G$7","v":"　結婚・妊娠・共育ての相談機会提供・支援プログラムを実施し、結婚に伴う新生活を経済的に支援するため新生活費用に対して補助を行う。\n　また、荒尾・玉名地域結婚サポートセンター（有明広域行政事務組合）と連携して婚活事業を実施し、出会いの場の創出を重点的に行う。事業実施後には、対象者にアンケート調査等を行い、次年度以降により効果的な取組を行えるように留意する。"},null,null,null,null,null,null,null,null,null,null,null,null,null,null,null,null,null,null,null,null,null,null,{"$f":"IF('1_共通入力シート【記載必須】'!H$7=\"\",\"\",'1_共通入力シート【記載必須】'!H$7)","v":"荒尾・玉名地域結婚サポートセンター新規会員数"},{"$f":"IF('1_共通入力シート【記載必須】'!I$7=\"\",\"\",'1_共通入力シート【記載必須】'!I$7)","v":"人"},{"$f":"IF('1_共通入力シート【記載必須】'!J$7=\"\",\"\",'1_共通入力シート【記載必須】'!J$7)","v":"1\n（R7年度～R11年度）"},{"$f":"IF('1_共通入力シート【記載必須】'!K$7=\"\",\"\",'1_共通入力シート【記載必須】'!K$7)","v":"0\n（R6年度\n1月時点）"},{"$f":"IF('1_共通入力シート【記載必須】'!L$7=\"\",\"\",'1_共通入力シート【記載必須】'!L$7)","v":"不妊治療補助件数"},{"$f":"IF('1_共通入力シート【記載必須】'!M$7=\"\",\"\",'1_共通入力シート【記載必須】'!M$7)","v":"件"},{"$f":"IF('1_共通入力シート【記載必須】'!N$7=\"\",\"\",'1_共通入力シート【記載必須】'!N$7)","v":"5\n（R7年度～R11年度）"},{"$f":"IF('1_共通入力シート【記載必須】'!O$7=\"\",\"\",'1_共通入力シート【記載必須】'!O$7)","v":"3\n（R6.4～R7.2）"},{"$f":"IF('1_共通入力シート【記載必須】'!P$7=\"\",\"\",'1_共通入力シート【記載必須】'!P$7)","v":"子育て関連講座参加者数"},{"$f":"IF('1_共通入力シート【記載必須】'!Q$7=\"\",\"\",'1_共通入力シート【記載必須】'!Q$7)","v":"人"},{"$f":"IF('1_共通入力シート【記載必須】'!R$7=\"\",\"\",'1_共通入力シート【記載必須】'!R$7)","v":"488\n（R7年度～R11年度）"},{"$f":"IF('1_共通入力シート【記載必須】'!S$7=\"\",\"\",'1_共通入力シート【記載必須】'!S$7)","v":"487\n（R6.4～R7.1）"},{"$f":"IF('1_共通入力シート【記載必須】'!T$7=\"\",\"\",'1_共通入力シート【記載必須】'!T$7)","v":"こども家庭センターにおける相談支援件数"},{"$f":"IF('1_共通入力シート【記載必須】'!U$7=\"\",\"\",'1_共通入力シート【記載必須】'!U$7)","v":"件"},{"$f":"IF('1_共通入力シート【記載必須】'!V$7=\"\",\"\",'1_共通入力シート【記載必須】'!V$7)","v":"60/年\n（R7年度～R11年度）"},{"$f":"IF('1_共通入力シート【記載必須】'!W$7=\"\",\"\",'1_共通入力シート【記載必須】'!W$7)","v":"47/年\n（R6.4～R7.1）"},{"$f":"IF('1_共通入力シート【記載必須】'!X$7=\"\",\"\",'1_共通入力シート【記載必須】'!X$7)","v":""},{"$f":"IF('1_共通入力シート【記載必須】'!Y$7=\"\",\"\",'1_共通入力シート【記載必須】'!Y$7)","v":""},{"$f":"IF('1_共通入力シート【記載必須】'!Z$7=\"\",\"\",'1_共通入力シート【記載必須】'!Z$7)","v":""},{"$f":"IF('1_共通入力シート【記載必須】'!AA$7=\"\",\"\",'1_共通入力シート【記載必須】'!AA$7)","v":""},{"$f":"IF('1_共通入力シート【記載必須】'!AB$7=\"\",\"\",'1_共通入力シート【記載必須】'!AB$7)","v":"合計特殊出生率"},{"$f":"IF('1_共通入力シート【記載必須】'!AC$7=\"\",\"\",'1_共通入力シート【記載必須】'!AC$7)","v":""},{"$f":"IF('1_共通入力シート【記載必須】'!AD$7=\"\",\"\",'1_共通入力シート【記載必須】'!AD$7)","v":"2.44\n（R6年）"},{"$f":"IF('1_共通入力シート【記載必須】'!AE$7=\"\",\"\",'1_共通入力シート【記載必須】'!AE$7)","v":"婚姻件数"},{"$f":"IF('1_共通入力シート【記載必須】'!AF$7=\"\",\"\",'1_共通入力シート【記載必須】'!AF$7)","v":"件"},{"$f":"IF('1_共通入力シート【記載必須】'!AG$7=\"\",\"\",'1_共通入力シート【記載必須】'!AG$7)","v":"22\n（R6年）"},{"$f":"IF('1_共通入力シート【記載必須】'!AH$7=\"\",\"\",'1_共通入力シート【記載必須】'!AH$7)","v":"婚姻率"},{"$f":"IF('1_共通入力シート【記載必須】'!AI$7=\"\",\"\",'1_共通入力シート【記載必須】'!AI$7)","v":""},{"$f":"IF('1_共通入力シート【記載必須】'!AJ$7=\"\",\"\",'1_共通入力シート【記載必須】'!AJ$7)","v":"4.27\n（R6年）"},null,null,null,null,null,null,null,null,null,null,null,null,null,null,null,null,null,null,null,null,"交付金事業に対する事業対象者（住民等）の満足度\n\n※該当事業のみ必須","％",null,null,"希望どおりの結婚に向けて後押ししてくれたと感じた人の割合\n\n※該当事業のみ必須","％",null,null,"結婚、妊娠・出産、子育てに前向きになったと感じた人の割合\n\n※該当事業のみ必須","％",null,null,null,null,null,null,null,null,null,null,null,null,null,null,null,null,null,null,null,null,null,null,null,null,null,"NG",null,"NG",null,"NG",null,"NG",null,"NG",null,"NG",null,"NG","OK",{"$f":"IFERROR(VLOOKUP($L21,リンク先!$E$147:$M$157,2,FALSE)&\"\",\"\")","v":""},null,"OK",{"$f":"IFERROR(VLOOKUP($L21,リンク先!$E$147:$M$157,3,FALSE)&\"\",\"\")","v":""},null,"OK",{"$f":"IFERROR(VLOOKUP($L21,リンク先!$E$147:$M$157,4,FALSE)&\"\",\"\")","v":""},null,"OK",null,null,"",{"$f":"IF(I21=リンク先!$C$12,4,VLOOKUP('1_共通入力シート【記載必須】'!$B$7,補助率判定!$B:$I,8,0))","v":2}]
[null,"⑯",{"$f":"'1_共通入力シート【記載必須】'!$B$7","v":"433641"},{"$f":"'1_共通入力シート【記載必須】'!$C$7","v":"市町村"},{"$f":"'1_共通入力シート【記載必須】'!$D$7","v":"熊本県"},{"$f":"'1_共通入力シート【記載必須】'!$E$7","v":"玉東町"},{"$f":"'1_共通入力シート【記載必須】'!$F$7","v":"熊本県玉東町"},null,null,null,null,null,null,{"$f":"IFERROR(VLOOKUP(GK22,リンク先!$F$3:$J$9,1+GL22,0),\"\")","v":""},{"$f":"AZ22","v":0},null,{"$f":"BA22","v":0},{"$f":"O22-P22","v":0},null,0,null,null,0,null,null,0,null,null,0,null,null,0,null,null,0,null,null,0,null,null,0,null,null,0,null,null,0,null,null,null,null,0,0,0,null,null,null,null,{"$f":"DATEVALUE(BF22&\"年12月31日\")","v":{"$error":"#VALUE!"}},2026,{"$f":"'1_共通入力シート【記載必須】'!$G$7","v":"　結婚・妊娠・共育ての相談機会提供・支援プログラムを実施し、結婚に伴う新生活を経済的に支援するため新生活費用に対して補助を行う。\n　また、荒尾・玉名地域結婚サポートセンター（有明広域行政事務組合）と連携して婚活事業を実施し、出会いの場の創出を重点的に行う。事業実施後には、対象者にアンケート調査等を行い、次年度以降により効果的な取組を行えるように留意する。"},null,null,null,null,null,null,null,null,null,null,null,null,null,null,null,null,null,null,null,null,null,null,{"$f":"IF('1_共通入力シート【記載必須】'!H$7=\"\",\"\",'1_共通入力シート【記載必須】'!H$7)","v":"荒尾・玉名地域結婚サポートセンター新規会員数"},{"$f":"IF('1_共通入力シート【記載必須】'!I$7=\"\",\"\",'1_共通入力シート【記載必須】'!I$7)","v":"人"},{"$f":"IF('1_共通入力シート【記載必須】'!J$7=\"\",\"\",'1_共通入力シート【記載必須】'!J$7)","v":"1\n（R7年度～R11年度）"},{"$f":"IF('1_共通入力シート【記載必須】'!K$7=\"\",\"\",'1_共通入力シート【記載必須】'!K$7)","v":"0\n（R6年度\n1月時点）"},{"$f":"IF('1_共通入力シート【記載必須】'!L$7=\"\",\"\",'1_共通入力シート【記載必須】'!L$7)","v":"不妊治療補助件数"},{"$f":"IF('1_共通入力シート【記載必須】'!M$7=\"\",\"\",'1_共通入力シート【記載必須】'!M$7)","v":"件"},{"$f":"IF('1_共通入力シート【記載必須】'!N$7=\"\",\"\",'1_共通入力シート【記載必須】'!N$7)","v":"5\n（R7年度～R11年度）"},{"$f":"IF('1_共通入力シート【記載必須】'!O$7=\"\",\"\",'1_共通入力シート【記載必須】'!O$7)","v":"3\n（R6.4～R7.2）"},{"$f":"IF('1_共通入力シート【記載必須】'!P$7=\"\",\"\",'1_共通入力シート【記載必須】'!P$7)","v":"子育て関連講座参加者数"},{"$f":"IF('1_共通入力シート【記載必須】'!Q$7=\"\",\"\",'1_共通入力シート【記載必須】'!Q$7)","v":"人"},{"$f":"IF('1_共通入力シート【記載必須】'!R$7=\"\",\"\",'1_共通入力シート【記載必須】'!R$7)","v":"488\n（R7年度～R11年度）"},{"$f":"IF('1_共通入力シート【記載必須】'!S$7=\"\",\"\",'1_共通入力シート【記載必須】'!S$7)","v":"487\n（R6.4～R7.1）"},{"$f":"IF('1_共通入力シート【記載必須】'!T$7=\"\",\"\",'1_共通入力シート【記載必須】'!T$7)","v":"こども家庭センターにおける相談支援件数"},{"$f":"IF('1_共通入力シート【記載必須】'!U$7=\"\",\"\",'1_共通入力シート【記載必須】'!U$7)","v":"件"},{"$f":"IF('1_共通入力シート【記載必須】'!V$7=\"\",\"\",'1_共通入力シート【記載必須】'!V$7)","v":"60/年\n（R7年度～R11年度）"},{"$f":"IF('1_共通入力シート【記載必須】'!W$7=\"\",\"\",'1_共通入力シート【記載必須】'!W$7)","v":"47/年\n（R6.4～R7.1）"},{"$f":"IF('1_共通入力シート【記載必須】'!X$7=\"\",\"\",'1_共通入力シート【記載必須】'!X$7)","v":""},{"$f":"IF('1_共通入力シート【記載必須】'!Y$7=\"\",\"\",'1_共通入力シート【記載必須】'!Y$7)","v":""},{"$f":"IF('1_共通入力シート【記載必須】'!Z$7=\"\",\"\",'1_共通入力シート【記載必須】'!Z$7)","v":""},{"$f":"IF('1_共通入力シート【記載必須】'!AA$7=\"\",\"\",'1_共通入力シート【記載必須】'!AA$7)","v":""},{"$f":"IF('1_共通入力シート【記載必須】'!AB$7=\"\",\"\",'1_共通入力シート【記載必須】'!AB$7)","v":"合計特殊出生率"},{"$f":"IF('1_共通入力シート【記載必須】'!AC$7=\"\",\"\",'1_共通入力シート【記載必須】'!AC$7)","v":""},{"$f":"IF('1_共通入力シート【記載必須】'!AD$7=\"\",\"\",'1_共通入力シート【記載必須】'!AD$7)","v":"2.44\n（R6年）"},{"$f":"IF('1_共通入力シート【記載必須】'!AE$7=\"\",\"\",'1_共通入力シート【記載必須】'!AE$7)","v":"婚姻件数"},{"$f":"IF('1_共通入力シート【記載必須】'!AF$7=\"\",\"\",'1_共通入力シート【記載必須】'!AF$7)","v":"件"},{"$f":"IF('1_共通入力シート【記載必須】'!AG$7=\"\",\"\",'1_共通入力シート【記載必須】'!AG$7)","v":"22\n（R6年）"},{"$f":"IF('1_共通入力シート【記載必須】'!AH$7=\"\",\"\",'1_共通入力シート【記載必須】'!AH$7)","v":"婚姻率"},{"$f":"IF('1_共通入力シート【記載必須】'!AI$7=\"\",\"\",'1_共通入力シート【記載必須】'!AI$7)","v":""},{"$f":"IF('1_共通入力シート【記載必須】'!AJ$7=\"\",\"\",'1_共通入力シート【記載必須】'!AJ$7)","v":"4.27\n（R6年）"},null,null,null,null,null,null,null,null,null,null,null,null,null,null,null,null,null,null,null,null,"交付金事業に対する事業対象者（住民等）の満足度\n\n※該当事業のみ必須","％",null,null,"希望どおりの結婚に向けて後押ししてくれたと感じた人の割合\n\n※該当事業のみ必須","％",null,null,"結婚、妊娠・出産、子育てに前向きになったと感じた人の割合\n\n※該当事業のみ必須","％",null,null,null,null,null,null,null,null,null,null,null,null,null,null,null,null,null,null,null,null,null,null,null,null,null,"NG",null,{"$f":"IF(FM22=\"含まれていない\",\"OK\",\"NG\")","v":"NG"},null,"NG",null,{"$f":"IF(FQ22=\"含まれていない\",\"OK\",\"NG\")","v":"NG"},null,{"$f":"IF(FS22=\"含まれていない\",\"OK\",\"NG\")","v":"NG"},null,"NG",null,{"$f":"IF(FW22=\"含まれていない\",\"OK\",\"NG\")","v":"NG"},"OK",{"$f":"IFERROR(VLOOKUP($L22,リンク先!$E$147:$M$157,2,FALSE)&\"\",\"\")","v":""},null,{"$f":"IF(OR(GA22=\"○\",FZ22=\"\"),\"OK\",\"NG\")","v":"OK"},{"$f":"IFERROR(VLOOKUP($L22,リンク先!$E$147:$M$157,3,FALSE)&\"\",\"\")","v":""},null,{"$f":"IF(OR(GD22=\"○\",GC22=\"\"),\"OK\",\"NG\")","v":"OK"},{"$f":"IFERROR(VLOOKUP($L22,リンク先!$E$147:$M$157,4,FALSE)&\"\",\"\")","v":""},null,{"$f":"IF(OR(GG22=\"○\",GF22=\"\"),\"OK\",\"NG\")","v":"OK"},null,null,"",{"$f":"IF(I22=リンク先!$C$12,4,VLOOKUP('1_共通入力シート【記載必須】'!$B$7,補助率判定!$B:$I,8,0))","v":2}]
[null,"⑰",{"$f":"'1_共通入力シート【記載必須】'!$B$7","v":"433641"},{"$f":"'1_共通入力シート【記載必須】'!$C$7","v":"市町村"},{"$f":"'1_共通入力シート【記載必須】'!$D$7","v":"熊本県"},{"$f":"'1_共通入力シート【記載必須】'!$E$7","v":"玉東町"},{"$f":"'1_共通入力シート【記載必須】'!$F$7","v":"熊本県玉東町"},null,null,null,null,null,null,{"$f":"IFERROR(VLOOKUP(GK23,リンク先!$F$3:$J$9,1+GL23,0),\"\")","v":""},0,null,0,0,null,0,null,null,0,null,null,0,null,null,0,null,null,0,null,null,0,null,null,0,null,null,0,null,null,0,null,null,0,null,null,null,null,0,0,0,null,null,null,null,{"$error":"#VALUE!"},2026,{"$f":"'1_共通入力シート【記載必須】'!$G$7","v":"　結婚・妊娠・共育ての相談機会提供・支援プログラムを実施し、結婚に伴う新生活を経済的に支援するため新生活費用に対して補助を行う。\n　また、荒尾・玉名地域結婚サポートセンター（有明広域行政事務組合）と連携して婚活事業を実施し、出会いの場の創出を重点的に行う。事業実施後には、対象者にアンケート調査等を行い、次年度以降により効果的な取組を行えるように留意する。"},null,null,null,null,null,null,null,null,null,null,null,null,null,null,null,null,null,null,null,null,null,null,{"$f":"IF('1_共通入力シート【記載必須】'!H$7=\"\",\"\",'1_共通入力シート【記載必須】'!H$7)","v":"荒尾・玉名地域結婚サポートセンター新規会員数"},{"$f":"IF('1_共通入力シート【記載必須】'!I$7=\"\",\"\",'1_共通入力シート【記載必須】'!I$7)","v":"人"},{"$f":"IF('1_共通入力シート【記載必須】'!J$7=\"\",\"\",'1_共通入力シート【記載必須】'!J$7)","v":"1\n（R7年度～R11年度）"},{"$f":"IF('1_共通入力シート【記載必須】'!K$7=\"\",\"\",'1_共通入力シート【記載必須】'!K$7)","v":"0\n（R6年度\n1月時点）"},{"$f":"IF('1_共通入力シート【記載必須】'!L$7=\"\",\"\",'1_共通入力シート【記載必須】'!L$7)","v":"不妊治療補助件数"},{"$f":"IF('1_共通入力シート【記載必須】'!M$7=\"\",\"\",'1_共通入力シート【記載必須】'!M$7)","v":"件"},{"$f":"IF('1_共通入力シート【記載必須】'!N$7=\"\",\"\",'1_共通入力シート【記載必須】'!N$7)","v":"5\n（R7年度～R11年度）"},{"$f":"IF('1_共通入力シート【記載必須】'!O$7=\"\",\"\",'1_共通入力シート【記載必須】'!O$7)","v":"3\n（R6.4～R7.2）"},{"$f":"IF('1_共通入力シート【記載必須】'!P$7=\"\",\"\",'1_共通入力シート【記載必須】'!P$7)","v":"子育て関連講座参加者数"},{"$f":"IF('1_共通入力シート【記載必須】'!Q$7=\"\",\"\",'1_共通入力シート【記載必須】'!Q$7)","v":"人"},{"$f":"IF('1_共通入力シート【記載必須】'!R$7=\"\",\"\",'1_共通入力シート【記載必須】'!R$7)","v":"488\n（R7年度～R11年度）"},{"$f":"IF('1_共通入力シート【記載必須】'!S$7=\"\",\"\",'1_共通入力シート【記載必須】'!S$7)","v":"487\n（R6.4～R7.1）"},{"$f":"IF('1_共通入力シート【記載必須】'!T$7=\"\",\"\",'1_共通入力シート【記載必須】'!T$7)","v":"こども家庭センターにおける相談支援件数"},{"$f":"IF('1_共通入力シート【記載必須】'!U$7=\"\",\"\",'1_共通入力シート【記載必須】'!U$7)","v":"件"},{"$f":"IF('1_共通入力シート【記載必須】'!V$7=\"\",\"\",'1_共通入力シート【記載必須】'!V$7)","v":"60/年\n（R7年度～R11年度）"},{"$f":"IF('1_共通入力シート【記載必須】'!W$7=\"\",\"\",'1_共通入力シート【記載必須】'!W$7)","v":"47/年\n（R6.4～R7.1）"},{"$f":"IF('1_共通入力シート【記載必須】'!X$7=\"\",\"\",'1_共通入力シート【記載必須】'!X$7)","v":""},{"$f":"IF('1_共通入力シート【記載必須】'!Y$7=\"\",\"\",'1_共通入力シート【記載必須】'!Y$7)","v":""},{"$f":"IF('1_共通入力シート【記載必須】'!Z$7=\"\",\"\",'1_共通入力シート【記載必須】'!Z$7)","v":""},{"$f":"IF('1_共通入力シート【記載必須】'!AA$7=\"\",\"\",'1_共通入力シート【記載必須】'!AA$7)","v":""},{"$f":"IF('1_共通入力シート【記載必須】'!AB$7=\"\",\"\",'1_共通入力シート【記載必須】'!AB$7)","v":"合計特殊出生率"},{"$f":"IF('1_共通入力シート【記載必須】'!AC$7=\"\",\"\",'1_共通入力シート【記載必須】'!AC$7)","v":""},{"$f":"IF('1_共通入力シート【記載必須】'!AD$7=\"\",\"\",'1_共通入力シート【記載必須】'!AD$7)","v":"2.44\n（R6年）"},{"$f":"IF('1_共通入力シート【記載必須】'!AE$7=\"\",\"\",'1_共通入力シート【記載必須】'!AE$7)","v":"婚姻件数"},{"$f":"IF('1_共通入力シート【記載必須】'!AF$7=\"\",\"\",'1_共通入力シート【記載必須】'!AF$7)","v":"件"},{"$f":"IF('1_共通入力シート【記載必須】'!AG$7=\"\",\"\",'1_共通入力シート【記載必須】'!AG$7)","v":"22\n（R6年）"},{"$f":"IF('1_共通入力シート【記載必須】'!AH$7=\"\",\"\",'1_共通入力シート【記載必須】'!AH$7)","v":"婚姻率"},{"$f":"IF('1_共通入力シート【記載必須】'!AI$7=\"\",\"\",'1_共通入力シート【記載必須】'!AI$7)","v":""},{"$f":"IF('1_共通入力シート【記載必須】'!AJ$7=\"\",\"\",'1_共通入力シート【記載必須】'!AJ$7)","v":"4.27\n（R6年）"},null,null,null,null,null,null,null,null,null,null,null,null,null,null,null,null,null,null,null,null,"交付金事業に対する事業対象者（住民等）の満足度\n\n※該当事業のみ必須","％",null,null,"希望どおりの結婚に向けて後押ししてくれたと感じた人の割合\n\n※該当事業のみ必須","％",null,null,"結婚、妊娠・出産、子育てに前向きになったと感じた人の割合\n\n※該当事業のみ必須","％",null,null,null,null,null,null,null,null,null,null,null,null,null,null,null,null,null,null,null,null,null,null,null,null,null,"NG",null,"NG",null,"NG",null,"NG",null,"NG",null,"NG",null,"NG","OK",{"$f":"IFERROR(VLOOKUP($L23,リンク先!$E$147:$M$157,2,FALSE)&\"\",\"\")","v":""},null,"OK",{"$f":"IFERROR(VLOOKUP($L23,リンク先!$E$147:$M$157,3,FALSE)&\"\",\"\")","v":""},null,"OK",{"$f":"IFERROR(VLOOKUP($L23,リンク先!$E$147:$M$157,4,FALSE)&\"\",\"\")","v":""},null,"OK",null,null,"",{"$f":"IF(I23=リンク先!$C$12,4,VLOOKUP('1_共通入力シート【記載必須】'!$B$7,補助率判定!$B:$I,8,0))","v":2}]
[null,"⑱",{"$f":"'1_共通入力シート【記載必須】'!$B$7","v":"433641"},{"$f":"'1_共通入力シート【記載必須】'!$C$7","v":"市町村"},{"$f":"'1_共通入力シート【記載必須】'!$D$7","v":"熊本県"},{"$f":"'1_共通入力シート【記載必須】'!$E$7","v":"玉東町"},{"$f":"'1_共通入力シート【記載必須】'!$F$7","v":"熊本県玉東町"},null,null,null,null,null,null,{"$f":"IFERROR(VLOOKUP(GK24,リンク先!$F$3:$J$9,1+GL24,0),\"\")","v":""},0,null,0,0,null,0,null,null,0,null,null,0,null,null,0,null,null,0,null,null,0,null,null,0,null,null,0,null,null,0,null,null,0,null,null,null,null,0,0,0,null,null,null,null,{"$error":"#VALUE!"},2026,{"$f":"'1_共通入力シート【記載必須】'!$G$7","v":"　結婚・妊娠・共育ての相談機会提供・支援プログラムを実施し、結婚に伴う新生活を経済的に支援するため新生活費用に対して補助を行う。\n　また、荒尾・玉名地域結婚サポートセンター（有明広域行政事務組合）と連携して婚活事業を実施し、出会いの場の創出を重点的に行う。事業実施後には、対象者にアンケート調査等を行い、次年度以降により効果的な取組を行えるように留意する。"},null,null,null,null,null,null,null,null,null,null,null,null,null,null,null,null,null,null,null,null,null,null,{"$f":"IF('1_共通入力シート【記載必須】'!H$7=\"\",\"\",'1_共通入力シート【記載必須】'!H$7)","v":"荒尾・玉名地域結婚サポートセンター新規会員数"},{"$f":"IF('1_共通入力シート【記載必須】'!I$7=\"\",\"\",'1_共通入力シート【記載必須】'!I$7)","v":"人"},{"$f":"IF('1_共通入力シート【記載必須】'!J$7=\"\",\"\",'1_共通入力シート【記載必須】'!J$7)","v":"1\n（R7年度～R11年度）"},{"$f":"IF('1_共通入力シート【記載必須】'!K$7=\"\",\"\",'1_共通入力シート【記載必須】'!K$7)","v":"0\n（R6年度\n1月時点）"},{"$f":"IF('1_共通入力シート【記載必須】'!L$7=\"\",\"\",'1_共通入力シート【記載必須】'!L$7)","v":"不妊治療補助件数"},{"$f":"IF('1_共通入力シート【記載必須】'!M$7=\"\",\"\",'1_共通入力シート【記載必須】'!M$7)","v":"件"},{"$f":"IF('1_共通入力シート【記載必須】'!N$7=\"\",\"\",'1_共通入力シート【記載必須】'!N$7)","v":"5\n（R7年度～R11年度）"},{"$f":"IF('1_共通入力シート【記載必須】'!O$7=\"\",\"\",'1_共通入力シート【記載必須】'!O$7)","v":"3\n（R6.4～R7.2）"},{"$f":"IF('1_共通入力シート【記載必須】'!P$7=\"\",\"\",'1_共通入力シート【記載必須】'!P$7)","v":"子育て関連講座参加者数"},{"$f":"IF('1_共通入力シート【記載必須】'!Q$7=\"\",\"\",'1_共通入力シート【記載必須】'!Q$7)","v":"人"},{"$f":"IF('1_共通入力シート【記載必須】'!R$7=\"\",\"\",'1_共通入力シート【記載必須】'!R$7)","v":"488\n（R7年度～R11年度）"},{"$f":"IF('1_共通入力シート【記載必須】'!S$7=\"\",\"\",'1_共通入力シート【記載必須】'!S$7)","v":"487\n（R6.4～R7.1）"},{"$f":"IF('1_共通入力シート【記載必須】'!T$7=\"\",\"\",'1_共通入力シート【記載必須】'!T$7)","v":"こども家庭センターにおける相談支援件数"},{"$f":"IF('1_共通入力シート【記載必須】'!U$7=\"\",\"\",'1_共通入力シート【記載必須】'!U$7)","v":"件"},{"$f":"IF('1_共通入力シート【記載必須】'!V$7=\"\",\"\",'1_共通入力シート【記載必須】'!V$7)","v":"60/年\n（R7年度～R11年度）"},{"$f":"IF('1_共通入力シート【記載必須】'!W$7=\"\",\"\",'1_共通入力シート【記載必須】'!W$7)","v":"47/年\n（R6.4～R7.1）"},{"$f":"IF('1_共通入力シート【記載必須】'!X$7=\"\",\"\",'1_共通入力シート【記載必須】'!X$7)","v":""},{"$f":"IF('1_共通入力シート【記載必須】'!Y$7=\"\",\"\",'1_共通入力シート【記載必須】'!Y$7)","v":""},{"$f":"IF('1_共通入力シート【記載必須】'!Z$7=\"\",\"\",'1_共通入力シート【記載必須】'!Z$7)","v":""},{"$f":"IF('1_共通入力シート【記載必須】'!AA$7=\"\",\"\",'1_共通入力シート【記載必須】'!AA$7)","v":""},{"$f":"IF('1_共通入力シート【記載必須】'!AB$7=\"\",\"\",'1_共通入力シート【記載必須】'!AB$7)","v":"合計特殊出生率"},{"$f":"IF('1_共通入力シート【記載必須】'!AC$7=\"\",\"\",'1_共通入力シート【記載必須】'!AC$7)","v":""},{"$f":"IF('1_共通入力シート【記載必須】'!AD$7=\"\",\"\",'1_共通入力シート【記載必須】'!AD$7)","v":"2.44\n（R6年）"},{"$f":"IF('1_共通入力シート【記載必須】'!AE$7=\"\",\"\",'1_共通入力シート【記載必須】'!AE$7)","v":"婚姻件数"},{"$f":"IF('1_共通入力シート【記載必須】'!AF$7=\"\",\"\",'1_共通入力シート【記載必須】'!AF$7)","v":"件"},{"$f":"IF('1_共通入力シート【記載必須】'!AG$7=\"\",\"\",'1_共通入力シート【記載必須】'!AG$7)","v":"22\n（R6年）"},{"$f":"IF('1_共通入力シート【記載必須】'!AH$7=\"\",\"\",'1_共通入力シート【記載必須】'!AH$7)","v":"婚姻率"},{"$f":"IF('1_共通入力シート【記載必須】'!AI$7=\"\",\"\",'1_共通入力シート【記載必須】'!AI$7)","v":""},{"$f":"IF('1_共通入力シート【記載必須】'!AJ$7=\"\",\"\",'1_共通入力シート【記載必須】'!AJ$7)","v":"4.27\n（R6年）"},null,null,null,null,null,null,null,null,null,null,null,null,null,null,null,null,null,null,null,null,"交付金事業に対する事業対象者（住民等）の満足度\n\n※該当事業のみ必須","％",null,null,"希望どおりの結婚に向けて後押ししてくれたと感じた人の割合\n\n※該当事業のみ必須","％",null,null,"結婚、妊娠・出産、子育てに前向きになったと感じた人の割合\n\n※該当事業のみ必須","％",null,null,null,null,null,null,null,null,null,null,null,null,null,null,null,null,null,null,null,null,null,null,null,null,null,"NG",null,"NG",null,"NG",null,"NG",null,"NG",null,"NG",null,"NG","OK",{"$f":"IFERROR(VLOOKUP($L24,リンク先!$E$147:$M$157,2,FALSE)&\"\",\"\")","v":""},null,"OK",{"$f":"IFERROR(VLOOKUP($L24,リンク先!$E$147:$M$157,3,FALSE)&\"\",\"\")","v":""},null,"OK",{"$f":"IFERROR(VLOOKUP($L24,リンク先!$E$147:$M$157,4,FALSE)&\"\",\"\")","v":""},null,"OK",null,null,"",{"$f":"IF(I24=リンク先!$C$12,4,VLOOKUP('1_共通入力シート【記載必須】'!$B$7,補助率判定!$B:$I,8,0))","v":2}]
[null,"⑲",{"$f":"'1_共通入力シート【記載必須】'!$B$7","v":"433641"},{"$f":"'1_共通入力シート【記載必須】'!$C$7","v":"市町村"},{"$f":"'1_共通入力シート【記載必須】'!$D$7","v":"熊本県"},{"$f":"'1_共通入力シート【記載必須】'!$E$7","v":"玉東町"},{"$f":"'1_共通入力シート【記載必須】'!$F$7","v":"熊本県玉東町"},null,null,null,null,null,null,{"$f":"IFERROR(VLOOKUP(GK25,リンク先!$F$3:$J$9,1+GL25,0),\"\")","v":""},{"$f":"AZ25","v":0},null,{"$f":"BA25","v":0},{"$f":"O25-P25","v":0},null,0,null,null,0,null,null,0,null,null,0,null,null,0,null,null,0,null,null,0,null,null,0,null,null,0,null,null,0,null,null,null,null,0,0,0,null,null,null,null,{"$f":"DATEVALUE(BF25&\"年12月31日\")","v":{"$error":"#VALUE!"}},2026,{"$f":"'1_共通入力シート【記載必須】'!$G$7","v":"　結婚・妊娠・共育ての相談機会提供・支援プログラムを実施し、結婚に伴う新生活を経済的に支援するため新生活費用に対して補助を行う。\n　また、荒尾・玉名地域結婚サポートセンター（有明広域行政事務組合）と連携して婚活事業を実施し、出会いの場の創出を重点的に行う。事業実施後には、対象者にアンケート調査等を行い、次年度以降により効果的な取組を行えるように留意する。"},null,null,null,null,null,null,null,null,null,null,null,null,null,null,null,null,null,null,null,null,null,null,{"$f":"IF('1_共通入力シート【記載必須】'!H$7=\"\",\"\",'1_共通入力シート【記載必須】'!H$7)","v":"荒尾・玉名地域結婚サポートセンター新規会員数"},{"$f":"IF('1_共通入力シート【記載必須】'!I$7=\"\",\"\",'1_共通入力シート【記載必須】'!I$7)","v":"人"},{"$f":"IF('1_共通入力シート【記載必須】'!J$7=\"\",\"\",'1_共通入力シート【記載必須】'!J$7)","v":"1\n（R7年度～R11年度）"},{"$f":"IF('1_共通入力シート【記載必須】'!K$7=\"\",\"\",'1_共通入力シート【記載必須】'!K$7)","v":"0\n（R6年度\n1月時点）"},{"$f":"IF('1_共通入力シート【記載必須】'!L$7=\"\",\"\",'1_共通入力シート【記載必須】'!L$7)","v":"不妊治療補助件数"},{"$f":"IF('1_共通入力シート【記載必須】'!M$7=\"\",\"\",'1_共通入力シート【記載必須】'!M$7)","v":"件"},{"$f":"IF('1_共通入力シート【記載必須】'!N$7=\"\",\"\",'1_共通入力シート【記載必須】'!N$7)","v":"5\n（R7年度～R11年度）"},{"$f":"IF('1_共通入力シート【記載必須】'!O$7=\"\",\"\",'1_共通入力シート【記載必須】'!O$7)","v":"3\n（R6.4～R7.2）"},{"$f":"IF('1_共通入力シート【記載必須】'!P$7=\"\",\"\",'1_共通入力シート【記載必須】'!P$7)","v":"子育て関連講座参加者数"},{"$f":"IF('1_共通入力シート【記載必須】'!Q$7=\"\",\"\",'1_共通入力シート【記載必須】'!Q$7)","v":"人"},{"$f":"IF('1_共通入力シート【記載必須】'!R$7=\"\",\"\",'1_共通入力シート【記載必須】'!R$7)","v":"488\n（R7年度～R11年度）"},{"$f":"IF('1_共通入力シート【記載必須】'!S$7=\"\",\"\",'1_共通入力シート【記載必須】'!S$7)","v":"487\n（R6.4～R7.1）"},{"$f":"IF('1_共通入力シート【記載必須】'!T$7=\"\",\"\",'1_共通入力シート【記載必須】'!T$7)","v":"こども家庭センターにおける相談支援件数"},{"$f":"IF('1_共通入力シート【記載必須】'!U$7=\"\",\"\",'1_共通入力シート【記載必須】'!U$7)","v":"件"},{"$f":"IF('1_共通入力シート【記載必須】'!V$7=\"\",\"\",'1_共通入力シート【記載必須】'!V$7)","v":"60/年\n（R7年度～R11年度）"},{"$f":"IF('1_共通入力シート【記載必須】'!W$7=\"\",\"\",'1_共通入力シート【記載必須】'!W$7)","v":"47/年\n（R6.4～R7.1）"},{"$f":"IF('1_共通入力シート【記載必須】'!X$7=\"\",\"\",'1_共通入力シート【記載必須】'!X$7)","v":""},{"$f":"IF('1_共通入力シート【記載必須】'!Y$7=\"\",\"\",'1_共通入力シート【記載必須】'!Y$7)","v":""},{"$f":"IF('1_共通入力シート【記載必須】'!Z$7=\"\",\"\",'1_共通入力シート【記載必須】'!Z$7)","v":""},{"$f":"IF('1_共通入力シート【記載必須】'!AA$7=\"\",\"\",'1_共通入力シート【記載必須】'!AA$7)","v":""},{"$f":"IF('1_共通入力シート【記載必須】'!AB$7=\"\",\"\",'1_共通入力シート【記載必須】'!AB$7)","v":"合計特殊出生率"},{"$f":"IF('1_共通入力シート【記載必須】'!AC$7=\"\",\"\",'1_共通入力シート【記載必須】'!AC$7)","v":""},{"$f":"IF('1_共通入力シート【記載必須】'!AD$7=\"\",\"\",'1_共通入力シート【記載必須】'!AD$7)","v":"2.44\n（R6年）"},{"$f":"IF('1_共通入力シート【記載必須】'!AE$7=\"\",\"\",'1_共通入力シート【記載必須】'!AE$7)","v":"婚姻件数"},{"$f":"IF('1_共通入力シート【記載必須】'!AF$7=\"\",\"\",'1_共通入力シート【記載必須】'!AF$7)","v":"件"},{"$f":"IF('1_共通入力シート【記載必須】'!AG$7=\"\",\"\",'1_共通入力シート【記載必須】'!AG$7)","v":"22\n（R6年）"},{"$f":"IF('1_共通入力シート【記載必須】'!AH$7=\"\",\"\",'1_共通入力シート【記載必須】'!AH$7)","v":"婚姻率"},{"$f":"IF('1_共通入力シート【記載必須】'!AI$7=\"\",\"\",'1_共通入力シート【記載必須】'!AI$7)","v":""},{"$f":"IF('1_共通入力シート【記載必須】'!AJ$7=\"\",\"\",'1_共通入力シート【記載必須】'!AJ$7)","v":"4.27\n（R6年）"},null,null,null,null,null,null,null,null,null,null,null,null,null,null,null,null,null,null,null,null,"交付金事業に対する事業対象者（住民等）の満足度\n\n※該当事業のみ必須","％",null,null,"希望どおりの結婚に向けて後押ししてくれたと感じた人の割合\n\n※該当事業のみ必須","％",null,null,"結婚、妊娠・出産、子育てに前向きになったと感じた人の割合\n\n※該当事業のみ必須","％",null,null,null,null,null,null,null,null,null,null,null,null,null,null,null,null,null,null,null,null,null,null,null,null,null,"NG",null,{"$f":"IF(FM25=\"含まれていない\",\"OK\",\"NG\")","v":"NG"},null,"NG",null,{"$f":"IF(FQ25=\"含まれていない\",\"OK\",\"NG\")","v":"NG"},null,{"$f":"IF(FS25=\"含まれていない\",\"OK\",\"NG\")","v":"NG"},null,"NG",null,{"$f":"IF(FW25=\"含まれていない\",\"OK\",\"NG\")","v":"NG"},"OK",{"$f":"IFERROR(VLOOKUP($L25,リンク先!$E$147:$M$157,2,FALSE)&\"\",\"\")","v":""},null,{"$f":"IF(OR(GA25=\"○\",FZ25=\"\"),\"OK\",\"NG\")","v":"OK"},{"$f":"IFERROR(VLOOKUP($L25,リンク先!$E$147:$M$157,3,FALSE)&\"\",\"\")","v":""},null,{"$f":"IF(OR(GD25=\"○\",GC25=\"\"),\"OK\",\"NG\")","v":"OK"},{"$f":"IFERROR(VLOOKUP($L25,リンク先!$E$147:$M$157,4,FALSE)&\"\",\"\")","v":""},null,{"$f":"IF(OR(GG25=\"○\",GF25=\"\"),\"OK\",\"NG\")","v":"OK"},null,null,"",{"$f":"IF(I25=リンク先!$C$12,4,VLOOKUP('1_共通入力シート【記載必須】'!$B$7,補助率判定!$B:$I,8,0))","v":2}]
[null,"記載例・留意点等",null,null,null,null,null,"（記載例）\n●●部●●課","（留意点）\n・原則として令和７年度予算を選択",null,null,null,"（記載例）\n●●市●●事業",null,null,null,"（留意点）\n・本交付金の対象外となる経費を除いた対象経費支出予定額（国補助率を乗じる前の額）を円単位で記載",null,null,null,null,null,null,null,null,null,null,null,null,null,null,null,null,null,null,null,null,null,null,null,null,null,null,null,null,null,null,null,null,null,null,null,null,null,"（記載例）\n令和8年4月1日",null,null,null,null,null,{"$f":"'1_共通入力シート【記載必須】'!$G$8","v":"（記載例）\n　過年度に引き続き、婚姻件数や婚姻率の低下に歯止めをかけるべく、出会いの場の創出を重点的に行うほか、主に若い世代に対してライフプランセミナーを重点的に行う。その際、EBPMを意識した事業を推進するため、実施後に事業対象者に丁寧にアンケート調査等を行い、次年度以降により効果的な取組を行えるように留意する。\n　また、結婚・妊娠・共育ての相談機会提供・支援プログラムを実施し、経済的不安から結婚に踏み切れない層に対して補助を行う。\n\n（留意点）\n・地域の実情及び課題を踏まえ、自治体が展開する少子化対策の全体像を記載"},"（記載例１）結婚支援センターの運営する場合\n出会いの場の創出に大きな役割を果たす●県結婚支援センターの運営を行うもの。\n\n（記載例２）婚活イベントを開催する場合\n出会いの場を創出するため、（●●市と連携して）●●イベントを実施する。","（記載例）\n婚活イベント・スキルアップセミナーの開催","（記載例）\n　結婚の希望を叶えられるよう、出会いの機会の場を提供するため、委託により次のとおり婚活イベントとスキルアップセミナーを開催する。\n　イベント・セミナーの開催にあたって、結婚支援センターの登録者への周知、参加を促すとともに、イベント・セミナー参加者に対して結婚支援センター、マッチングシステムへの登録案内、イベン・セミナー開催後に結婚相談員による個別相談の機会を設ける。\n\n○体験型イベント（年3回）\n・参加予定者数（定員）：●人（男女各●人×3回）\n・内容：●●体験など\n・対象：おおむね●～●歳の独身者\n※参加費を次のとおり徴収し、徴収した参加費は、「寄付金その他の収入額」として計上。\n　男性＠2,000円×●名、女性＠1,000円×●名　（小計●円×３回）\n\n○女性向けセミナー\n・体験型セミナー３回\n・参加予定者数（定員）：●人（●人×3回）\n・内容：●●など\n\n○男性向けセミナー\n・イベントの前に講演型セミナー3回\n・参加予定者数（定員）：●人（●人×3回）\n・内容：●●など\n\n○周知・広報について\n・チラシ配布（●枚）、市ホームページ、専用特設サイト、SNS（インスタグラム、エックス（旧_ツイッター）、フェイスブック、ラインなど）","（記載例）\nセミナー・ワークショップの実施","（記載例）\n　県内の高校・大学と連携し、ライフデザインセミナー及びワークショップを実施する。妊娠・出産の正しい知識と結婚・子育てに関するマネーライフプランニング等について、子育て世帯をファシリテーターとし、複数のロールモデルを提供する一助とする。（ファシリテーターは公募の上、決定する）\n　※対象：県内大学●校、県内高校●校を予定\n　※回数：●回を想定","（記載例）\nライフデザイン啓発サイトの開発","（記載例）\n・ライフデザインを描くために必要なデータを充実させ、正しい知識に基づいて人生設計ができるよう支援する。\n・サイト上でライフデザインをシミュレーションできるツールを提供する。\n・若い世代へ普及するための効果的な手段としてSNSを活用した広報・周知を行う。",null,null,null,null,null,null,null,null,null,null,null,null,null,null,"（記載例）\n・本事業の開催方法について、前年度において幅広い年齢層を対象としたことによりマッチング率が下がったことを踏まえ、対象年齢を引き下げ、若い世代を中心に集客を図る。\n・本事業の周知方法について、更なる集客を図るため、従来の広報誌に加え、ＳＮＳ広告を行う。\n\n（留意点）\n・一般財源での実施も含めた継続事業については、過年度の事業で浮かび上がった課題の分析やそれに対する取組（ステップアップ）を記載\n・新規事業については記載不要。",{"$f":"'1_共通入力シート【記載必須】'!$H$8","v":"（記載例）\n公的結婚支援による成婚者数"},{"$f":"'1_共通入力シート【記載必須】'!$I$8","v":"件"},{"$f":"'1_共通入力シート【記載必須】'!$J$8","v":"300（R10年度）"},{"$f":"'1_共通入力シート【記載必須】'!$K$8","v":"100（R6年度）\nor\n数値がない場合は「---」"},null,null,null,null,null,null,null,null,null,null,null,null,null,null,null,null,null,null,{"$f":"'1_共通入力シート【記載必須】'!$AD$8","v":"1.5（R6年）\nor\n数値がない場合は「---」"},null,null,null,null,null,null,null,null,"100（R8年度）","50（R7年度見込）\nor\n50（R6年度）\nor\n数値がない場合は「---」",null,null,null,null,null,null,null,null,null,null,null,null,null,null,null,null,null,null,"100（R8年度）","50（R7年度見込）\nor\n50（R6年度）\nor\n数値がない場合は「---」",null,null,null,null,null,null,null,null,null,null,null,null,null,null,null,null,null,null,null,null,null,null,null,null,null,null,null,null,"（記載例）\n2026/3/31","（記載例）\n2026/7/10",null,null,null,null,null,null,null,null,null,null,"（留意点）\n・別途配布する「留意点等」を参照すること。"]

{"sheet":"3_個別入力シート（支援プログラム）","index":2,"n_rows":9,"n_cols":99,"rows_kept":9,"cut":false,"hidden":false,"merged":[[1,39,1,50],[2,4,4,4],[2,5,4,5],[2,7,4,7],[2,13,4,13],[1,8,1,16],[2,6,4,6],[1,1,1,7],[1,30,1,34],[2,40,4,40],[2,41,4,41],[2,42,4,42],[2,43,4,43],[2,48,4,48],[2,49,4,49],[2,16,4,16],[8,86,8,87],[2,14,4,14],[2,23,4,23],[0,1,0,7],[7,44,8,44],[2,1,4,1],[2,2,4,2],[2,3,4,3],[2,15,4,15],[2,17,4,17],[7,14,7,15],[1,26,1,29],[1,35,1,38],[2,29,4,29],[2,30,4,30],[2,31,4,31],[9,1,9,7],[2,21,4,21],[2,22,4,22],[2,27,4,27],[2,28,4,28],[2,8,4,8],[2,9,4,9],[2,10,4,10],[2,11,4,11],[2,12,4,12],[2,18,4,19],[2,24,4,24],[2,25,4,25],[2,26,4,26],[2,20,4,20],[1,80,1,83],[3,59,3,62],[3,63,3,66],[3,67,3,70],[3,71,3,73],[1,51,1,70],[1,71,1,79],[2,80,2,83],[3,80,3,83],[2,32,4,32],[2,39,4,39],[2,33,4,33],[7,45,7,46],[2,46,4,46],[2,45,4,45],[2,34,4,34],[2,44,4,44],[2,35,4,35],[2,36,4,36],[2,37,4,37],[2,38,4,38],[2,50,4,50],[2,47,4,47],[3,51,3,54],[2,51,2,70],[2,71,2,79],[3,74,3,76],[3,77,3,79],[3,55,3,58],[1,84,1,91],[2,84,2,91],[3,88,3,91],[1,92,1,94],[2,92,2,94],[3,92,4,92],[3,93,3,94],[3,84,3,87]]}
[null,"個別入力シート\n【結婚・妊娠・共育ての相談機会提供・支援プログラム】"]
[null,null,null,null,null,null,null,null,"※メニューに係るリスト（プルダウン）については、選択内容によって分岐して表示されるように設定されているため、左から順番に選択すること。\n※これらの欄は、「4_総括表への転記シート」に自動転記",null,null,null,null,null,null,null,null,null,null,null,null,null,null,null,null,null,"【対象費目】\n※対象とする費用に「〇」を選択すること。",null,null,null,"【補助対象要件_自治体独自基準】\n※所得要件・年齢要件・補助上限額は150字以内・その他独自要件は250字以内で要約してください。\n※国基準のとおりであれば空欄のままとしてください。",null,null,null,null,"【（参考）令和７年度_申請状況】\n令和７年12月時点における申請実績世帯数及び令和８年１月～３月の申請見込世帯数を記載",null,null,null,"【令和８年度_申請見込】\n①新規世帯見込については、継続補助分（D）を除いた本年度の見込世帯数（A・B・C）を記載\n②継続補助世帯見込については、継続補助規定の有無、前年度補助上限額未満の支給見込世帯数（D）及び対象経費支出予定額（G）を記載\n③A・B・D・Gの値については、「4_総括表への転記シート」に自動転記",null,null,null,null,null,null,null,null,null,null,null,"【自治体における全体ＫＰＩ】\n※全ての個別事業共通（地域少子化対策重点推進事業・結婚・妊娠・共育ての相談機会提供・支援プログラムいずれも共通）\n※少子化対策に関連した各自治体における計画（総合計画、総合戦略、次世代育成計画等）で設定しているKPIの主な項目を最大５つまで記載",null,null,null,null,null,null,null,null,null,null,null,null,null,null,null,null,null,null,null,"【自治体における参考指標】\n※全ての個別事業共通（地域少子化対策重点推進事業・\n結婚・妊娠・共育ての相談機会提供・支援プログラムいずれも共通）\n※項目名は変更しないこと。",null,null,null,null,null,null,null,null,"【個別事業における個別ＫＰＩ（アウトプット）】\n※項目名は変更しないこと。",null,null,null,"【個別事業における個別ＫＰＩ（アウトカム）】\n※項目名は変更しないこと。",null,null,null,null,null,null,null,"【予算時期調査】\n※市町村事業を実施する場合、実施主体の市町村において予算が措置されていることに加え、都道府県においても対応する予算が措置されていることが必要です。"]
[null,"個票番号","自治体コード\n６桁","自治体の区分\n【リスト選択】","都道府県名\n【リスト選択】","市町村名","都道府県名\n＋\n市町村名\n【自動表記】","本事業の担当部局名","国予算区分\n【リスト選択】","事業メニュー","区分\n【リスト選択】","関連事業メニュー\n【リスト選択】","個別事業名","国補助率\n【自動表記】","Ａ\n総事業費（円）\n※自治体単費分を\n含むこと。\n※必ずA≧Cとすること。","Ｂ\n寄付金その他の収入予定額（円）","Ｃ\n対象経費支出予定額（円）\n※国補助率を乗じる前の額\n※必ずA≧Cとすること。","A-Ｂ\n差引額（円）\n【自動表記】","実施期間（和暦）\n※始期については原則として\n4/1とすること。\nなお、年度途中の変更決定を受けてから開始する場合は「交付決定日」とすること。\n※終期については原則として\n3/31とすること。",null,"新規／継続\n(一般財源での\n実施も含む)\n【リスト選択】","事業開始\n年度（西暦）\n※新規の場合は「2026」と入力","事業開始\n年度（和暦）\n【自動表記】","経過年度\n【自動表記】","自治体における少子化対策の全体像\n※全ての個別事業共通（地域少子化対策重点推進事業・結婚・妊娠・共育ての相談機会提供・支援プログラムいずれも共通）\n※250字以内（2～3段落程度）で要約してください。","自治体における少子化対策の全体像の中での本個別事業の位置付け\n※250字以内（2～3段落程度）で要約してください。","住宅取得費用","住宅リフォーム費用","住宅賃借費用","引越費用","所得要件_独自基準\n\n\n※国基準のとおりであれば空欄","年齢要件_独自基準\n\n\n※国基準のとおりであれば空欄","補助上限額_独自基準\n29歳以下\n\n※国基準のとおりであれば空欄","補助上限額_独自基準\n39歳以下\n\n※国基準のとおりであれば空欄","その他独自要件","事業実施の有無\n【リスト選択】","～12月\n実績\n世帯数","1月～3月\n見込\n世帯数","申請世帯\n見込数\n（実績+見込）\n【自動表記】","Ａ\n29歳以下\n世帯数","Ｂ\nその他\n世帯数","Ｃ\n新規世帯\n見込数\n（Ａ+Ｂ）\n【自動表記】","Ｄ\n継続補助世帯\n見込数","継続補助\n規定の有無\n【リスト選択】","世帯数積算根拠\n※簡潔に記載してください。","Ｅ\n29歳以下\n上限額\n(Ａ×60万円)\n【自動表記】","Ｆ\nその他\n上限額\n(Ｂ×30万円)\n【自動表記】","Ｇ\n継続補助\n対象経費\n支出予定額\n（円）","Ｈ\n上限額\n合計\n（E+F+Ｇ）\n【自動表記】","※左記のＨ(上限額の合計)を（「対象経費支出予定額」として）使用しない場合の金額積算根拠\n※Ｈ＞「対象経費支出予定額（国補助率を乗じる前の額）」となる場合のみ簡潔に記載\n※Ｈ＝「対象経費支出予定額（国補助率を乗じる前の額）」となる場合は空欄のままとしてください。","広報の実施予定\n※250字以内で要約してください。","少子化対策全体の重要業績評価指標(KPI)及び定量的成果目標",null,null,null,null,null,null,null,null,null,null,null,null,null,null,null,null,null,null,null,"参考指標",null,null,null,null,null,null,null,null,"個別事業の重要業績評価指標(KPI)及び定量的成果目標【アウトプット】",null,null,null,"個別事業の重要業績評価指標(KPI)及び定量的成果目標【アウトカム】"]
[null,null,null,null,null,null,null,null,null,null,null,null,null,null,null,null,null,null,null,null,null,null,null,null,null,null,null,null,null,null,null,null,null,null,null,null,null,null,null,null,null,null,null,null,null,null,null,null,null,null,null,"①",null,null,null,"②",null,null,null,"③",null,null,null,"④",null,null,null,"⑤",null,null,null,"①",null,null,"②",null,null,"③",null,null,"①",null,null,null,"①",null,null,null,"②",null,null,null,"実施自治体の\n予算議決(予定)日","年度途中の交付決定を\n希望する場合のみ記載"]
[null,null,null,null,null,null,null,null,null,null,null,null,null,null,null,null,null,null,null,null,null,null,null,null,null,null,null,null,null,null,null,null,null,null,null,null,null,null,null,null,null,null,null,null,null,null,null,null,null,null,null,"項目名","単位\n【リスト選択】","目標値（時点）","現状値（時点）","項目名","単位\n【リスト選択】","目標値（時点）","現状値（時点）","項目名","単位\n【リスト選択】","目標値（時点）","現状値（時点）","項目名","単位\n【リスト選択】","目標値（時点）","現状値（時点）","項目名","単位\n【リスト選択】","目標値（時点）","現状値（時点）","項目名","単位","直近の\n実績値(時点)","項目名","単位","直近の\n実績値(時点)","項目名","単位","直近の\n実績値（時点）","項目名","単位","目標値（時点）","現状値（時点）","項目名","単位","目標値（時点）","現状値（時点）","項目名","単位","目標値（時点）","現状値（時点）",null,"国からの交付決定希望日\n※7月～3月中旬(10日～20日)を目安とすること。","備考"]
[null,"vlookup用列番号",{"$f":"COLUMN(C5)-COLUMN($B5)+1","v":2},{"$f":"COLUMN(D5)-COLUMN($B5)+1","v":3},{"$f":"COLUMN(E5)-COLUMN($B5)+1","v":4},{"$f":"COLUMN(F5)-COLUMN($B5)+1","v":5},{"$f":"COLUMN(G5)-COLUMN($B5)+1","v":6},7,8,9,10,11,12,13,14,15,16,17,{"$f":"COLUMN(S5)-COLUMN($B5)+1","v":18},{"$f":"COLUMN(T5)-COLUMN($B5)+1","v":19},20,{"$f":"COLUMN(V5)-COLUMN($B5)+1","v":21},22,{"$f":"COLUMN(X5)-COLUMN($B5)+1","v":23},{"$f":"COLUMN(Y5)-COLUMN($B5)+1","v":24},25,{"$f":"COLUMN(AA5)-COLUMN($B5)+1","v":26},{"$f":"COLUMN(AB5)-COLUMN($B5)+1","v":27},28,{"$f":"COLUMN(AD5)-COLUMN($B5)+1","v":29},{"$f":"COLUMN(AE5)-COLUMN($B5)+1","v":30},31,32,33,34,35,{"$f":"COLUMN(AK5)-COLUMN($B5)+1","v":36},37,38,39,40,{"$f":"COLUMN(AP5)-COLUMN($B5)+1","v":41},{"$f":"COLUMN(AQ5)-COLUMN($B5)+1","v":42},{"$f":"COLUMN(AR5)-COLUMN($B5)+1","v":43},44,45,46,{"$f":"COLUMN(AV5)-COLUMN($B5)+1","v":47},{"$f":"COLUMN(AW5)-COLUMN($B5)+1","v":48},49,50,{"$f":"COLUMN(AZ5)-COLUMN($B5)+1","v":51},{"$f":"COLUMN(BA5)-COLUMN($B5)+1","v":52},{"$f":"COLUMN(BB5)-COLUMN($B5)+1","v":53},{"$f":"COLUMN(BC5)-COLUMN($B5)+1","v":54},{"$f":"COLUMN(BD5)-COLUMN($B5)+1","v":55},{"$f":"COLUMN(BE5)-COLUMN($B5)+1","v":56},{"$f":"COLUMN(BF5)-COLUMN($B5)+1","v":57},{"$f":"COLUMN(BG5)-COLUMN($B5)+1","v":58},{"$f":"COLUMN(BH5)-COLUMN($B5)+1","v":59},{"$f":"COLUMN(BI5)-COLUMN($B5)+1","v":60},{"$f":"COLUMN(BJ5)-COLUMN($B5)+1","v":61},{"$f":"COLUMN(BK5)-COLUMN($B5)+1","v":62},{"$f":"COLUMN(BL5)-COLUMN($B5)+1","v":63},{"$f":"COLUMN(BM5)-COLUMN($B5)+1","v":64},{"$f":"COLUMN(BN5)-COLUMN($B5)+1","v":65},{"$f":"COLUMN(BO5)-COLUMN($B5)+1","v":66},{"$f":"COLUMN(BP5)-COLUMN($B5)+1","v":67},{"$f":"COLUMN(BQ5)-COLUMN($B5)+1","v":68},{"$f":"COLUMN(BR5)-COLUMN($B5)+1","v":69},{"$f":"COLUMN(BS5)-COLUMN($B5)+1","v":70},{"$f":"COLUMN(BT5)-COLUMN($B5)+1","v":71},{"$f":"COLUMN(BU5)-COLUMN($B5)+1","v":72},{"$f":"COLUMN(BV5)-COLUMN($B5)+1","v":73},{"$f":"COLUMN(BW5)-COLUMN($B5)+1","v":74},{"$f":"COLUMN(BX5)-COLUMN($B5)+1","v":75},{"$f":"COLUMN(BY5)-COLUMN($B5)+1","v":76},{"$f":"COLUMN(BZ5)-COLUMN($B5)+1","v":77},{"$f":"COLUMN(CA5)-COLUMN($B5)+1","v":78},{"$f":"COLUMN(CB5)-COLUMN($B5)+1","v":79},{"$f":"COLUMN(CC5)-COLUMN($B5)+1","v":80},{"$f":"COLUMN(CD5)-COLUMN($B5)+1","v":81},{"$f":"COLUMN(CE5)-COLUMN($B5)+1","v":82},{"$f":"COLUMN(CF5)-COLUMN($B5)+1","v":83},{"$f":"COLUMN(CG5)-COLUMN($B5)+1","v":84},{"$f":"COLUMN(CH5)-COLUMN($B5)+1","v":85},{"$f":"COLUMN(CI5)-COLUMN($B5)+1","v":86},{"$f":"COLUMN(CJ5)-COLUMN($B5)+1","v":87},{"$f":"COLUMN(CK5)-COLUMN($B5)+1","v":88},{"$f":"COLUMN(CL5)-COLUMN($B5)+1","v":89},{"$f":"COLUMN(CM5)-COLUMN($B5)+1","v":90},{"$f":"COLUMN(CN5)-COLUMN($B5)+1","v":91},92,93,94,null,null,"補助率検索用キー","補助率判定"]
[null,"支援プ①",{"$f":"'1_共通入力シート【記載必須】'!$B$7","v":"433641"},{"$f":"'1_共通入力シート【記載必須】'!$C$7","v":"市町村"},{"$f":"'1_共通入力シート【記載必須】'!$D$7","v":"熊本県"},{"$f":"'1_共通入力シート【記載必須】'!$E$7","v":"玉東町"},{"$f":"'1_共通入力シート【記載必須】'!$F$7","v":"熊本県玉東町"},"企画財政課","R7","結婚・妊娠・共育ての相談機会提供・支援プログラム","一般コース","4_1 結婚・妊娠・共育ての相談機会提供・支援プログラム（一般コース）","玉東町結婚新生活支援事業",{"$f":"IFERROR(VLOOKUP(CT7,リンク先!$F$3:$J$9,1+CU7,0),\"\")","v":0.5},2400000,0,2400000,{"$f":"O7-P7","v":2400000},"令和8年4月1日","令和9年3月31日","継続",2016,{"$f":"DATEVALUE(V7&\"年12月31日\")","v":42735},{"$f":"2026-V7","v":10},{"$f":"'1_共通入力シート【記載必須】'!$G$7","v":"　結婚・妊娠・共育ての相談機会提供・支援プログラムを実施し、結婚に伴う新生活を経済的に支援するため新生活費用に対して補助を行う。\n　また、荒尾・玉名地域結婚サポートセンター（有明広域行政事務組合）と連携して婚活事業を実施し、出会いの場の創出を重点的に行う。事業実施後には、対象者にアンケート調査等を行い、次年度以降により効果的な取組を行えるように留意する。"},"結婚・出産・子育ての希望をかなえ、安心して暮らすことが出来る魅力的な地域をつくる。","○","○","○","○",null,null,null,null,null,"実施中",1,1,{"$f":"SUM(AK7:AL7)","v":2},2,2,{"$f":"SUM(AN7:AO7)","v":4},2,"有","・申請見込については、令和5年度及び令和6年度の当事業における支給実績から4世帯とした。（R5年度：4件、R6年度5件）",{"$f":"600000*AN7","v":1200000},{"$f":"300000*AO7","v":600000},600000,{"$f":"SUM(AT7:AV7)","v":2400000},null,"・町ホームページおよび広報紙、公式ＬＩＮＥを活用し積極的に周知するほか、窓口において婚姻者に周知を図る。",{"$f":"IF('1_共通入力シート【記載必須】'!H$7=\"\",\"\",'1_共通入力シート【記載必須】'!H$7)","v":"荒尾・玉名地域結婚サポートセンター新規会員数"},{"$f":"IF('1_共通入力シート【記載必須】'!I$7=\"\",\"\",'1_共通入力シート【記載必須】'!I$7)","v":"人"},{"$f":"IF('1_共通入力シート【記載必須】'!J$7=\"\",\"\",'1_共通入力シート【記載必須】'!J$7)","v":"1\n（R7年度～R11年度）"},{"$f":"IF('1_共通入力シート【記載必須】'!K$7=\"\",\"\",'1_共通入力シート【記載必須】'!K$7)","v":"0\n（R6年度\n1月時点）"},{"$f":"IF('1_共通入力シート【記載必須】'!L$7=\"\",\"\",'1_共通入力シート【記載必須】'!L$7)","v":"不妊治療補助件数"},{"$f":"IF('1_共通入力シート【記載必須】'!M$7=\"\",\"\",'1_共通入力シート【記載必須】'!M$7)","v":"件"},{"$f":"IF('1_共通入力シート【記載必須】'!N$7=\"\",\"\",'1_共通入力シート【記載必須】'!N$7)","v":"5\n（R7年度～R11年度）"},{"$f":"IF('1_共通入力シート【記載必須】'!O$7=\"\",\"\",'1_共通入力シート【記載必須】'!O$7)","v":"3\n（R6.4～R7.2）"},{"$f":"IF('1_共通入力シート【記載必須】'!P$7=\"\",\"\",'1_共通入力シート【記載必須】'!P$7)","v":"子育て関連講座参加者数"},{"$f":"IF('1_共通入力シート【記載必須】'!Q$7=\"\",\"\",'1_共通入力シート【記載必須】'!Q$7)","v":"人"},{"$f":"IF('1_共通入力シート【記載必須】'!R$7=\"\",\"\",'1_共通入力シート【記載必須】'!R$7)","v":"488\n（R7年度～R11年度）"},{"$f":"IF('1_共通入力シート【記載必須】'!S$7=\"\",\"\",'1_共通入力シート【記載必須】'!S$7)","v":"487\n（R6.4～R7.1）"},{"$f":"IF('1_共通入力シート【記載必須】'!T$7=\"\",\"\",'1_共通入力シート【記載必須】'!T$7)","v":"こども家庭センターにおける相談支援件数"},{"$f":"IF('1_共通入力シート【記載必須】'!U$7=\"\",\"\",'1_共通入力シート【記載必須】'!U$7)","v":"件"},{"$f":"IF('1_共通入力シート【記載必須】'!V$7=\"\",\"\",'1_共通入力シート【記載必須】'!V$7)","v":"60/年\n（R7年度～R11年度）"},{"$f":"IF('1_共通入力シート【記載必須】'!W$7=\"\",\"\",'1_共通入力シート【記載必須】'!W$7)","v":"47/年\n（R6.4～R7.1）"},{"$f":"IF('1_共通入力シート【記載必須】'!X$7=\"\",\"\",'1_共通入力シート【記載必須】'!X$7)","v":""},{"$f":"IF('1_共通入力シート【記載必須】'!Y$7=\"\",\"\",'1_共通入力シート【記載必須】'!Y$7)","v":""},{"$f":"IF('1_共通入力シート【記載必須】'!Z$7=\"\",\"\",'1_共通入力シート【記載必須】'!Z$7)","v":""},{"$f":"IF('1_共通入力シート【記載必須】'!AA$7=\"\",\"\",'1_共通入力シート【記載必須】'!AA$7)","v":""},{"$f":"IF('1_共通入力シート【記載必須】'!AB$7=\"\",\"\",'1_共通入力シート【記載必須】'!AB$7)","v":"合計特殊出生率"},{"$f":"IF('1_共通入力シート【記載必須】'!AC$7=\"\",\"\",'1_共通入力シート【記載必須】'!AC$7)","v":""},{"$f":"IF('1_共通入力シート【記載必須】'!AD$7=\"\",\"\",'1_共通入力シート【記載必須】'!AD$7)","v":"2.44\n（R6年）"},{"$f":"IF('1_共通入力シート【記載必須】'!AE$7=\"\",\"\",'1_共通入力シート【記載必須】'!AE$7)","v":"婚姻件数"},{"$f":"IF('1_共通入力シート【記載必須】'!AF$7=\"\",\"\",'1_共通入力シート【記載必須】'!AF$7)","v":"件"},{"$f":"IF('1_共通入力シート【記載必須】'!AG$7=\"\",\"\",'1_共通入力シート【記載必須】'!AG$7)","v":"22\n（R6年）"},{"$f":"IF('1_共通入力シート【記載必須】'!AH$7=\"\",\"\",'1_共通入力シート【記載必須】'!AH$7)","v":"婚姻率"},{"$f":"IF('1_共通入力シート【記載必須】'!AI$7=\"\",\"\",'1_共通入力シート【記載必須】'!AI$7)","v":""},{"$f":"IF('1_共通入力シート【記載必須】'!AJ$7=\"\",\"\",'1_共通入力シート【記載必須】'!AJ$7)","v":"4.27\n（R6年）"},"支給世帯実績／支給見込世帯数の割合","％","100（R8年度）","33.3（R7年度見込）","結婚・妊娠・共育ての相談機会提供・支援プログラムに関するアンケートにおける「本事業の認知度」","％","80（R8年度）","80（R6年度実績）","結婚・妊娠・共育ての相談機会提供・支援プログラムに関するアンケートにおける「地域に応援されていると感じた世帯の割合」","％","80（R8年度）","80（R6年度実績）","2026-03-31",null,null,null,null,{"$f":"J7&K7","v":"結婚・妊娠・共育ての相談機会提供・支援プログラム一般コース"},{"$f":"IF(I7=リンク先!$C$12,4,VLOOKUP('1_共通入力シート【記載必須】'!$B$7,補助率判定!$B:$I,8,0))","v":4}]
[null,"記載例・留意点等",null,null,null,null,null,"（記載例）\n●●部●●課","（留意点）\n・原則として令和７年度予算を選択",null,null,null,"（記載例）\n●●市支援プログラム",null,null,null,"（留意点）\n・本交付金の対象外となる経費を除いた対象経費支出予定額（国補助率を乗じる前の額）を円単位で記載",null,"（記載例）\n令和8年4月1日",null,null,null,null,null,{"$f":"'1_共通入力シート【記載必須】'!$G$8","v":"（記載例）\n　過年度に引き続き、婚姻件数や婚姻率の低下に歯止めをかけるべく、出会いの場の創出を重点的に行うほか、主に若い世代に対してライフプランセミナーを重点的に行う。その際、EBPMを意識した事業を推進するため、実施後に事業対象者に丁寧にアンケート調査等を行い、次年度以降により効果的な取組を行えるように留意する。\n　また、結婚・妊娠・共育ての相談機会提供・支援プログラムを実施し、経済的不安から結婚に踏み切れない層に対して補助を行う。\n\n（留意点）\n・地域の実情及び課題を踏まえ、自治体が展開する少子化対策の全体像を記載"},"（記載例）\n　結婚・妊娠・共育ての相談機会提供・支援プログラムを実施し、経済的不安から結婚に踏み切れない層に対して補助を行うもの。",null,null,null,null,"（記載例）\n夫婦の合計所得が600万円未満\n※要件緩和分は自治体単費にて実施\n\n【国基準】\n夫婦の合計所得が500万円未満","（記載例）\n夫婦ともに婚姻日における年齢が40歳以下の世帯\n※要件緩和分は自治体単費にて実施\n\n【国基準】\n夫婦ともに婚姻日における年齢が39歳以下の世帯","（記載例）\n各費用に係る合計が30万円\n\n【国基準】\n各費用に係る合計が60万円","（記載例）\n各費用に係る合計が15万円\n\n【国基準】\n各費用に係る合計が30万円","（留意点）\n特段の記載が必要であると実施自治体が判断した要件（例　左記のほか国基準を超えて自治体単費で対応する必要がある要件など）のみとし、必ずしも全て列挙する必要はないものとする。",null,null,null,null,null,null,null,null,"（留意点）\n要綱等に規定がある場合（実施年度に継続補助見込みがない場合も含む）は「有」を選択すること。","（記載例１）直近の支給実績に基づいた積算\n・申請見込については、令和●年度の当事業における支給実績を引用。\n\n（記載例２）住民、税務担当へ照会し、直近の婚姻件数のうち、年齢、所得要件を満たす世帯を算出し積算\n・29歳以下〇世帯については、令和●年度の夫婦ともに婚姻日における年齢が29歳以下の婚姻件数△件のうち、所得500万円未満の世帯数を税務課において確認し、算出。\n・その他〇世帯については、令和●年度の夫婦ともに婚姻日における年齢が39歳以下（ともに29歳以下を除く）の婚姻件数▲件のうち、所得500万円未満の世帯数を税務課において確認し、算出。\n\n（記載例３）人口動態統計における婚姻件数及び国民生活基礎調査における世帯年収から対象世帯を算出する積算\n・29歳以下申請見込：〇世帯＝①100件×②45％×④85％\n・上記以外申請見込：〇世帯＝①100件×③45％×⑤65%\n①「令和●年度人口動態統計」直近年度のＡ市年間婚姻件数100件\n②「令和●年度人口動態統計」直近年度の結婚生活に入った夫婦ともに29歳以下の世帯割合45％\n③「令和●年度人口動態統計」直近年度の結婚生活に入った夫婦ともに39歳以下の世帯割合90％のうち、\nともに29歳以下を除いた世帯割合：90%－②45%＝45%\n④「令和●年度国民生活基礎調査」直近年度の世帯主の年齢別、世帯所得の割合\n29歳以下の世帯総数のうち、世帯収入が700万円以下（所得換算約500万円）の世帯の割合85％\n⑤「令和●年度国民生活基礎調査」直近年度の世帯主の年齢別、世帯所得の割合\n30歳以上39歳以下世帯総数のうち、世帯収入が700万円以下（所得換算約500万円）の世帯の割合65％",null,null,"冒頭で入力済みの対象経費支出予定額→",{"$f":"Q7","v":2400000},"（自治体独自基準にて単価を引き下げて積算する場合の記載例）\n・（29歳以下）   3世帯×300,000円＝900,000円\n・（その他）       2世帯×150,000円＝300,000円\n・（継続補助）　  　　　　　　  　　　　 　   150,000円\n　　　　　　　　  　　　　　　 　　  　   　計1,350,000円","（記載例）\n・チラシの印刷・配布（1,000枚）を行い、引越業者に配架を依頼する。",{"$f":"'1_共通入力シート【記載必須】'!$H$8","v":"（記載例）\n公的結婚支援による成婚者数"},{"$f":"'1_共通入力シート【記載必須】'!$I$8","v":"件"},{"$f":"'1_共通入力シート【記載必須】'!$J$8","v":"300（R10年度）"},{"$f":"'1_共通入力シート【記載必須】'!$K$8","v":"100（R6年度）\nor\n数値がない場合は「---」"},null,null,null,null,null,null,null,null,null,null,null,null,null,null,null,null,null,null,{"$f":"'1_共通入力シート【記載必須】'!$AD$8","v":"1.5（R6年）\nor\n数値がない場合は「---」"},null,null,null,null,null,null,null,null,"100（R8年度）","50（R7年度見込）\nor\n50（R6年度実績）\nor\n数値がない場合は「---」",null,null,"80（R8年度）","50（R7年度見込）\nor\n50（R6年度実績）\nor\n数値がない場合は「---」",null,null,null,null,"（記載例）\n2026/3/31","（記載例）\n2026/7/10"]
[null,null,null,null,null,null,null,null,null,null,null,null,null,null,null,null,null,null,null,null,null,null,null,null,null,null,null,null,null,null,null,null,null,null,null,null,null,null,null,null,null,null,null,null,null,null,null,"「Ｈ 上限額」と「対象経費支出予定額」との\n大小チェック結果⇒",{"$f":"IF(AW7>Q7,\"H＞「対象経費支出予定額」\",IF(AW7=Q7,\"H＝「対象経費支出予定額」\",IF(AW7<Q7,\"H＜「対象経費支出予定額」(×のため「対象経費支出予定額」を要修正)\")))","v":"H＝「対象経費支出予定額」"}]

{"sheet":"4_総括表への転記シート","index":3,"n_rows":24,"n_cols":26,"rows_kept":24,"cut":false,"hidden":false,"merged":[[0,14,1,18],[2,23,3,23],[2,24,2,25],[2,20,2,22],[4,1,23,1],[4,2,23,2],[24,2,24,12],[25,2,25,12],[0,5,0,8]]}
[null,null,null,null,null,"地域少子化対策重点推進交付金（令和８年度実施事業）実施計画総括表　（転記元）",null,null,null,null,null,null,null,null,"※支援プログラムを選択した場合に記入\n（様式1-1の備考欄に自動転記）"]
[]
[null,"実施自治体",null,null,null,"事業一覧",null,null,null,null,"所要見込額（円）",null,null,null,"新規世帯見込",null,null,"継続補助世帯見込",null,null,"実施自治体",null,null,"実施自治体の\n予算議決(予定)日","年度途中の交付決定を\n希望する場合のみ記載"]
[null,"自治体名","区分","個票番号","予算区分","事業メニュー","区分","関連事業メニュー","個別事業名","補助率","総事業費","寄付金その他の収入予定額","対象経費支出予定額",null,"世帯数(世帯数(29歳以下+その他))","29歳以下","その他","世帯数","対象経費支出予定額(円)",null,"自治体コード","自治体名","区分",null,"国からの交付決定希望日","備考"]
[null,{"$f":"'1_共通入力シート【記載必須】'!F7","v":"熊本県玉東町"},{"$f":"W5","v":"市町村"},"①",{"$f":"IF('2_個別入力シート（支援プログラム以外）'!I7<>\"\",'2_個別入力シート（支援プログラム以外）'!I7,\"\")","v":""},{"$f":"IF('2_個別入力シート（支援プログラム以外）'!J7<>\"\",'2_個別入力シート（支援プログラム以外）'!J7,\"\")","v":""},{"$f":"IF('2_個別入力シート（支援プログラム以外）'!K7<>\"\",'2_個別入力シート（支援プログラム以外）'!K7,\"\")","v":""},{"$f":"IF('2_個別入力シート（支援プログラム以外）'!L7<>\"\",'2_個別入力シート（支援プログラム以外）'!L7,\"\")","v":""},{"$f":"IF('2_個別入力シート（支援プログラム以外）'!M7<>\"\",'2_個別入力シート（支援プログラム以外）'!M7,\"\")","v":""},{"$f":"IF('2_個別入力シート（支援プログラム以外）'!N7<>\"\",'2_個別入力シート（支援プログラム以外）'!N7,\"\")","v":""},{"$f":"'2_個別入力シート（支援プログラム以外）'!O7","v":0},{"$f":"'2_個別入力シート（支援プログラム以外）'!P7","v":0},{"$f":"'2_個別入力シート（支援プログラム以外）'!Q7","v":0},null,null,null,null,null,null,null,{"$f":"'1_共通入力シート【記載必須】'!$B$7","v":"433641"},{"$f":"IF('1_共通入力シート【記載必須】'!$E$7=\"\",'1_共通入力シート【記載必須】'!$D$7,'1_共通入力シート【記載必須】'!$E$7)","v":"玉東町"},{"$f":"'1_共通入力シート【記載必須】'!$C$7","v":"市町村"},{"$f":"'2_個別入力シート（支援プログラム以外）'!FI7","v":"00:00:00"},{"$f":"'2_個別入力シート（支援プログラム以外）'!FJ7","v":"00:00:00"},{"$f":"'2_個別入力シート（支援プログラム以外）'!FK7","v":0}]
[null,null,null,"②",{"$f":"IF('2_個別入力シート（支援プログラム以外）'!I8<>\"\",'2_個別入力シート（支援プログラム以外）'!I8,\"\")","v":""},{"$f":"IF('2_個別入力シート（支援プログラム以外）'!J8<>\"\",'2_個別入力シート（支援プログラム以外）'!J8,\"\")","v":""},{"$f":"IF('2_個別入力シート（支援プログラム以外）'!K8<>\"\",'2_個別入力シート（支援プログラム以外）'!K8,\"\")","v":""},{"$f":"IF('2_個別入力シート（支援プログラム以外）'!L8<>\"\",'2_個別入力シート（支援プログラム以外）'!L8,\"\")","v":""},{"$f":"IF('2_個別入力シート（支援プログラム以外）'!M8<>\"\",'2_個別入力シート（支援プログラム以外）'!M8,\"\")","v":""},{"$f":"IF('2_個別入力シート（支援プログラム以外）'!N8<>\"\",'2_個別入力シート（支援プログラム以外）'!N8,\"\")","v":""},{"$f":"'2_個別入力シート（支援プログラム以外）'!O8","v":0},{"$f":"'2_個別入力シート（支援プログラム以外）'!P8","v":0},{"$f":"'2_個別入力シート（支援プログラム以外）'!Q8","v":0},null,null,null,null,null,null,null,{"$f":"'1_共通入力シート【記載必須】'!$B$7","v":"433641"},{"$f":"IF('1_共通入力シート【記載必須】'!$E$7=\"\",'1_共通入力シート【記載必須】'!$D$7,'1_共通入力シート【記載必須】'!$E$7)","v":"玉東町"},{"$f":"'1_共通入力シート【記載必須】'!$C$7","v":"市町村"},{"$f":"'2_個別入力シート（支援プログラム以外）'!FI8","v":"00:00:00"},{"$f":"'2_個別入力シート（支援プログラム以外）'!FJ8","v":"00:00:00"},{"$f":"'2_個別入力シート（支援プログラム以外）'!FK8","v":0}]
[null,null,null,"③",{"$f":"IF('2_個別入力シート（支援プログラム以外）'!I9<>\"\",'2_個別入力シート（支援プログラム以外）'!I9,\"\")","v":""},{"$f":"IF('2_個別入力シート（支援プログラム以外）'!J9<>\"\",'2_個別入力シート（支援プログラム以外）'!J9,\"\")","v":""},{"$f":"IF('2_個別入力シート（支援プログラム以外）'!K9<>\"\",'2_個別入力シート（支援プログラム以外）'!K9,\"\")","v":""},{"$f":"IF('2_個別入力シート（支援プログラム以外）'!L9<>\"\",'2_個別入力シート（支援プログラム以外）'!L9,\"\")","v":""},{"$f":"IF('2_個別入力シート（支援プログラム以外）'!M9<>\"\",'2_個別入力シート（支援プログラム以外）'!M9,\"\")","v":""},{"$f":"IF('2_個別入力シート（支援プログラム以外）'!N9<>\"\",'2_個別入力シート（支援プログラム以外）'!N9,\"\")","v":""},{"$f":"'2_個別入力シート（支援プログラム以外）'!O9","v":0},{"$f":"'2_個別入力シート（支援プログラム以外）'!P9","v":0},{"$f":"'2_個別入力シート（支援プログラム以外）'!Q9","v":0},null,null,null,null,null,null,null,{"$f":"'1_共通入力シート【記載必須】'!$B$7","v":"433641"},{"$f":"IF('1_共通入力シート【記載必須】'!$E$7=\"\",'1_共通入力シート【記載必須】'!$D$7,'1_共通入力シート【記載必須】'!$E$7)","v":"玉東町"},{"$f":"'1_共通入力シート【記載必須】'!$C$7","v":"市町村"},{"$f":"'2_個別入力シート（支援プログラム以外）'!FI9","v":"00:00:00"},{"$f":"'2_個別入力シート（支援プログラム以外）'!FJ9","v":"00:00:00"},{"$f":"'2_個別入力シート（支援プログラム以外）'!FK9","v":0}]
[null,null,null,"④",{"$f":"IF('2_個別入力シート（支援プログラム以外）'!I10<>\"\",'2_個別入力シート（支援プログラム以外）'!I10,\"\")","v":""},{"$f":"IF('2_個別入力シート（支援プログラム以外）'!J10<>\"\",'2_個別入力シート（支援プログラム以外）'!J10,\"\")","v":""},{"$f":"IF('2_個別入力シート（支援プログラム以外）'!K10<>\"\",'2_個別入力シート（支援プログラム以外）'!K10,\"\")","v":""},{"$f":"IF('2_個別入力シート（支援プログラム以外）'!L10<>\"\",'2_個別入力シート（支援プログラム以外）'!L10,\"\")","v":""},{"$f":"IF('2_個別入力シート（支援プログラム以外）'!M10<>\"\",'2_個別入力シート（支援プログラム以外）'!M10,\"\")","v":""},{"$f":"IF('2_個別入力シート（支援プログラム以外）'!N10<>\"\",'2_個別入力シート（支援プログラム以外）'!N10,\"\")","v":""},{"$f":"'2_個別入力シート（支援プログラム以外）'!O10","v":0},{"$f":"'2_個別入力シート（支援プログラム以外）'!P10","v":0},{"$f":"'2_個別入力シート（支援プログラム以外）'!Q10","v":0},null,null,null,null,null,null,null,{"$f":"'1_共通入力シート【記載必須】'!$B$7","v":"433641"},{"$f":"IF('1_共通入力シート【記載必須】'!$E$7=\"\",'1_共通入力シート【記載必須】'!$D$7,'1_共通入力シート【記載必須】'!$E$7)","v":"玉東町"},{"$f":"'1_共通入力シート【記載必須】'!$C$7","v":"市町村"},{"$f":"'2_個別入力シート（支援プログラム以外）'!FI10","v":"00:00:00"},{"$f":"'2_個別入力シート（支援プログラム以外）'!FJ10","v":"00:00:00"},{"$f":"'2_個別入力シート（支援プログラム以外）'!FK10","v":0}]
[null,null,null,"⑤",{"$f":"IF('2_個別入力シート（支援プログラム以外）'!I11<>\"\",'2_個別入力シート（支援プログラム以外）'!I11,\"\")","v":""},{"$f":"IF('2_個別入力シート（支援プログラム以外）'!J11<>\"\",'2_個別入力シート（支援プログラム以外）'!J11,\"\")","v":""},{"$f":"IF('2_個別入力シート（支援プログラム以外）'!K11<>\"\",'2_個別入力シート（支援プログラム以外）'!K11,\"\")","v":""},{"$f":"IF('2_個別入力シート（支援プログラム以外）'!L11<>\"\",'2_個別入力シート（支援プログラム以外）'!L11,\"\")","v":""},{"$f":"IF('2_個別入力シート（支援プログラム以外）'!M11<>\"\",'2_個別入力シート（支援プログラム以外）'!M11,\"\")","v":""},{"$f":"IF('2_個別入力シート（支援プログラム以外）'!N11<>\"\",'2_個別入力シート（支援プログラム以外）'!N11,\"\")","v":""},{"$f":"'2_個別入力シート（支援プログラム以外）'!O11","v":0},{"$f":"'2_個別入力シート（支援プログラム以外）'!P11","v":0},{"$f":"'2_個別入力シート（支援プログラム以外）'!Q11","v":0},null,null,null,null,null,null,null,{"$f":"'1_共通入力シート【記載必須】'!$B$7","v":"433641"},{"$f":"IF('1_共通入力シート【記載必須】'!$E$7=\"\",'1_共通入力シート【記載必須】'!$D$7,'1_共通入力シート【記載必須】'!$E$7)","v":"玉東町"},{"$f":"'1_共通入力シート【記載必須】'!$C$7","v":"市町村"},{"$f":"'2_個別入力シート（支援プログラム以外）'!FI11","v":"00:00:00"},{"$f":"'2_個別入力シート（支援プログラム以外）'!FJ11","v":"00:00:00"},{"$f":"'2_個別入力シート（支援プログラム以外）'!FK11","v":0}]
[null,null,null,"⑥",{"$f":"IF('2_個別入力シート（支援プログラム以外）'!I12<>\"\",'2_個別入力シート（支援プログラム以外）'!I12,\"\")","v":""},{"$f":"IF('2_個別入力シート（支援プログラム以外）'!J12<>\"\",'2_個別入力シート（支援プログラム以外）'!J12,\"\")","v":""},{"$f":"IF('2_個別入力シート（支援プログラム以外）'!K12<>\"\",'2_個別入力シート（支援プログラム以外）'!K12,\"\")","v":""},{"$f":"IF('2_個別入力シート（支援プログラム以外）'!L12<>\"\",'2_個別入力シート（支援プログラム以外）'!L12,\"\")","v":""},{"$f":"IF('2_個別入力シート（支援プログラム以外）'!M12<>\"\",'2_個別入力シート（支援プログラム以外）'!M12,\"\")","v":""},{"$f":"IF('2_個別入力シート（支援プログラム以外）'!N12<>\"\",'2_個別入力シート（支援プログラム以外）'!N12,\"\")","v":""},{"$f":"'2_個別入力シート（支援プログラム以外）'!O12","v":0},{"$f":"'2_個別入力シート（支援プログラム以外）'!P12","v":0},{"$f":"'2_個別入力シート（支援プログラム以外）'!Q12","v":0},null,null,null,null,null,null,null,{"$f":"'1_共通入力シート【記載必須】'!$B$7","v":"433641"},{"$f":"IF('1_共通入力シート【記載必須】'!$E$7=\"\",'1_共通入力シート【記載必須】'!$D$7,'1_共通入力シート【記載必須】'!$E$7)","v":"玉東町"},{"$f":"'1_共通入力シート【記載必須】'!$C$7","v":"市町村"},{"$f":"'2_個別入力シート（支援プログラム以外）'!FI12","v":"00:00:00"},{"$f":"'2_個別入力シート（支援プログラム以外）'!FJ12","v":"00:00:00"},{"$f":"'2_個別入力シート（支援プログラム以外）'!FK12","v":0}]
[null,null,null,"⑦",{"$f":"IF('2_個別入力シート（支援プログラム以外）'!I13<>\"\",'2_個別入力シート（支援プログラム以外）'!I13,\"\")","v":""},{"$f":"IF('2_個別入力シート（支援プログラム以外）'!J13<>\"\",'2_個別入力シート（支援プログラム以外）'!J13,\"\")","v":""},{"$f":"IF('2_個別入力シート（支援プログラム以外）'!K13<>\"\",'2_個別入力シート（支援プログラム以外）'!K13,\"\")","v":""},{"$f":"IF('2_個別入力シート（支援プログラム以外）'!L13<>\"\",'2_個別入力シート（支援プログラム以外）'!L13,\"\")","v":""},{"$f":"IF('2_個別入力シート（支援プログラム以外）'!M13<>\"\",'2_個別入力シート（支援プログラム以外）'!M13,\"\")","v":""},{"$f":"IF('2_個別入力シート（支援プログラム以外）'!N13<>\"\",'2_個別入力シート（支援プログラム以外）'!N13,\"\")","v":""},{"$f":"'2_個別入力シート（支援プログラム以外）'!O13","v":0},{"$f":"'2_個別入力シート（支援プログラム以外）'!P13","v":0},{"$f":"'2_個別入力シート（支援プログラム以外）'!Q13","v":0},null,null,null,null,null,null,null,{"$f":"'1_共通入力シート【記載必須】'!$B$7","v":"433641"},{"$f":"IF('1_共通入力シート【記載必須】'!$E$7=\"\",'1_共通入力シート【記載必須】'!$D$7,'1_共通入力シート【記載必須】'!$E$7)","v":"玉東町"},{"$f":"'1_共通入力シート【記載必須】'!$C$7","v":"市町村"},{"$f":"'2_個別入力シート（支援プログラム以外）'!FI13","v":"00:00:00"},{"$f":"'2_個別入力シート（支援プログラム以外）'!FJ13","v":"00:00:00"},{"$f":"'2_個別入力シート（支援プログラム以外）'!FK13","v":0}]
[null,null,null,"⑧",{"$f":"IF('2_個別入力シート（支援プログラム以外）'!I14<>\"\",'2_個別入力シート（支援プログラム以外）'!I14,\"\")","v":""},{"$f":"IF('2_個別入力シート（支援プログラム以外）'!J14<>\"\",'2_個別入力シート（支援プログラム以外）'!J14,\"\")","v":""},{"$f":"IF('2_個別入力シート（支援プログラム以外）'!K14<>\"\",'2_個別入力シート（支援プログラム以外）'!K14,\"\")","v":""},{"$f":"IF('2_個別入力シート（支援プログラム以外）'!L14<>\"\",'2_個別入力シート（支援プログラム以外）'!L14,\"\")","v":""},{"$f":"IF('2_個別入力シート（支援プログラム以外）'!M14<>\"\",'2_個別入力シート（支援プログラム以外）'!M14,\"\")","v":""},{"$f":"IF('2_個別入力シート（支援プログラム以外）'!N14<>\"\",'2_個別入力シート（支援プログラム以外）'!N14,\"\")","v":""},{"$f":"'2_個別入力シート（支援プログラム以外）'!O14","v":0},{"$f":"'2_個別入力シート（支援プログラム以外）'!P14","v":0},{"$f":"'2_個別入力シート（支援プログラム以外）'!Q14","v":0},null,null,null,null,null,null,null,{"$f":"'1_共通入力シート【記載必須】'!$B$7","v":"433641"},{"$f":"IF('1_共通入力シート【記載必須】'!$E$7=\"\",'1_共通入力シート【記載必須】'!$D$7,'1_共通入力シート【記載必須】'!$E$7)","v":"玉東町"},{"$f":"'1_共通入力シート【記載必須】'!$C$7","v":"市町村"},{"$f":"'2_個別入力シート（支援プログラム以外）'!FI14","v":"00:00:00"},{"$f":"'2_個別入力シート（支援プログラム以外）'!FJ14","v":"00:00:00"},{"$f":"'2_個別入力シート（支援プログラム以外）'!FK14","v":0}]
[null,null,null,"⑨",{"$f":"IF('2_個別入力シート（支援プログラム以外）'!I15<>\"\",'2_個別入力シート（支援プログラム以外）'!I15,\"\")","v":""},{"$f":"IF('2_個別入力シート（支援プログラム以外）'!J15<>\"\",'2_個別入力シート（支援プログラム以外）'!J15,\"\")","v":""},{"$f":"IF('2_個別入力シート（支援プログラム以外）'!K15<>\"\",'2_個別入力シート（支援プログラム以外）'!K15,\"\")","v":""},{"$f":"IF('2_個別入力シート（支援プログラム以外）'!L15<>\"\",'2_個別入力シート（支援プログラム以外）'!L15,\"\")","v":""},{"$f":"IF('2_個別入力シート（支援プログラム以外）'!M15<>\"\",'2_個別入力シート（支援プログラム以外）'!M15,\"\")","v":""},{"$f":"IF('2_個別入力シート（支援プログラム以外）'!N15<>\"\",'2_個別入力シート（支援プログラム以外）'!N15,\"\")","v":""},{"$f":"'2_個別入力シート（支援プログラム以外）'!O15","v":0},{"$f":"'2_個別入力シート（支援プログラム以外）'!P15","v":0},{"$f":"'2_個別入力シート（支援プログラム以外）'!Q15","v":0},null,null,null,null,null,null,null,{"$f":"'1_共通入力シート【記載必須】'!$B$7","v":"433641"},{"$f":"IF('1_共通入力シート【記載必須】'!$E$7=\"\",'1_共通入力シート【記載必須】'!$D$7,'1_共通入力シート【記載必須】'!$E$7)","v":"玉東町"},{"$f":"'1_共通入力シート【記載必須】'!$C$7","v":"市町村"},{"$f":"'2_個別入力シート（支援プログラム以外）'!FI15","v":"00:00:00"},{"$f":"'2_個別入力シート（支援プログラム以外）'!FJ15","v":"00:00:00"},{"$f":"'2_個別入力シート（支援プログラム以外）'!FK15","v":0}]
[null,null,null,"⑩",{"$f":"IF('2_個別入力シート（支援プログラム以外）'!I16<>\"\",'2_個別入力シート（支援プログラム以外）'!I16,\"\")","v":""},{"$f":"IF('2_個別入力シート（支援プログラム以外）'!J16<>\"\",'2_個別入力シート（支援プログラム以外）'!J16,\"\")","v":""},{"$f":"IF('2_個別入力シート（支援プログラム以外）'!K16<>\"\",'2_個別入力シート（支援プログラム以外）'!K16,\"\")","v":""},{"$f":"IF('2_個別入力シート（支援プログラム以外）'!L16<>\"\",'2_個別入力シート（支援プログラム以外）'!L16,\"\")","v":""},{"$f":"IF('2_個別入力シート（支援プログラム以外）'!M16<>\"\",'2_個別入力シート（支援プログラム以外）'!M16,\"\")","v":""},{"$f":"IF('2_個別入力シート（支援プログラム以外）'!N16<>\"\",'2_個別入力シート（支援プログラム以外）'!N16,\"\")","v":""},{"$f":"'2_個別入力シート（支援プログラム以外）'!O16","v":0},{"$f":"'2_個別入力シート（支援プログラム以外）'!P16","v":0},{"$f":"'2_個別入力シート（支援プログラム以外）'!Q16","v":0},null,null,null,null,null,null,null,{"$f":"'1_共通入力シート【記載必須】'!$B$7","v":"433641"},{"$f":"IF('1_共通入力シート【記載必須】'!$E$7=\"\",'1_共通入力シート【記載必須】'!$D$7,'1_共通入力シート【記載必須】'!$E$7)","v":"玉東町"},{"$f":"'1_共通入力シート【記載必須】'!$C$7","v":"市町村"},{"$f":"'2_個別入力シート（支援プログラム以外）'!FI16","v":"00:00:00"},{"$f":"'2_個別入力シート（支援プログラム以外）'!FJ16","v":"00:00:00"},{"$f":"'2_個別入力シート（支援プログラム以外）'!FK16","v":0}]
[null,null,null,"⑪",{"$f":"IF('2_個別入力シート（支援プログラム以外）'!I17<>\"\",'2_個別入力シート（支援プログラム以外）'!I17,\"\")","v":""},{"$f":"IF('2_個別入力シート（支援プログラム以外）'!J17<>\"\",'2_個別入力シート（支援プログラム以外）'!J17,\"\")","v":""},{"$f":"IF('2_個別入力シート（支援プログラム以外）'!K17<>\"\",'2_個別入力シート（支援プログラム以外）'!K17,\"\")","v":""},{"$f":"IF('2_個別入力シート（支援プログラム以外）'!L17<>\"\",'2_個別入力シート（支援プログラム以外）'!L17,\"\")","v":""},{"$f":"IF('2_個別入力シート（支援プログラム以外）'!M17<>\"\",'2_個別入力シート（支援プログラム以外）'!M17,\"\")","v":""},{"$f":"IF('2_個別入力シート（支援プログラム以外）'!N17<>\"\",'2_個別入力シート（支援プログラム以外）'!N17,\"\")","v":""},{"$f":"'2_個別入力シート（支援プログラム以外）'!O17","v":0},{"$f":"'2_個別入力シート（支援プログラム以外）'!P17","v":0},{"$f":"'2_個別入力シート（支援プログラム以外）'!Q17","v":0},null,null,null,null,null,null,null,{"$f":"'1_共通入力シート【記載必須】'!$B$7","v":"433641"},{"$f":"IF('1_共通入力シート【記載必須】'!$E$7=\"\",'1_共通入力シート【記載必須】'!$D$7,'1_共通入力シート【記載必須】'!$E$7)","v":"玉東町"},{"$f":"'1_共通入力シート【記載必須】'!$C$7","v":"市町村"},{"$f":"'2_個別入力シート（支援プログラム以外）'!FI17","v":"00:00:00"},{"$f":"'2_個別入力シート（支援プログラム以外）'!FJ17","v":"00:00:00"},{"$f":"'2_個別入力シート（支援プログラム以外）'!FK17","v":0}]
[null,null,null,"⑫",{"$f":"IF('2_個別入力シート（支援プログラム以外）'!I18<>\"\",'2_個別入力シート（支援プログラム以外）'!I18,\"\")","v":""},{"$f":"IF('2_個別入力シート（支援プログラム以外）'!J18<>\"\",'2_個別入力シート（支援プログラム以外）'!J18,\"\")","v":""},{"$f":"IF('2_個別入力シート（支援プログラム以外）'!K18<>\"\",'2_個別入力シート（支援プログラム以外）'!K18,\"\")","v":""},{"$f":"IF('2_個別入力シート（支援プログラム以外）'!L18<>\"\",'2_個別入力シート（支援プログラム以外）'!L18,\"\")","v":""},{"$f":"IF('2_個別入力シート（支援プログラム以外）'!M18<>\"\",'2_個別入力シート（支援プログラム以外）'!M18,\"\")","v":""},{"$f":"IF('2_個別入力シート（支援プログラム以外）'!N18<>\"\",'2_個別入力シート（支援プログラム以外）'!N18,\"\")","v":""},{"$f":"'2_個別入力シート（支援プログラム以外）'!O18","v":0},{"$f":"'2_個別入力シート（支援プログラム以外）'!P18","v":0},{"$f":"'2_個別入力シート（支援プログラム以外）'!Q18","v":0},null,null,null,null,null,null,null,{"$f":"'1_共通入力シート【記載必須】'!$B$7","v":"433641"},{"$f":"IF('1_共通入力シート【記載必須】'!$E$7=\"\",'1_共通入力シート【記載必須】'!$D$7,'1_共通入力シート【記載必須】'!$E$7)","v":"玉東町"},{"$f":"'1_共通入力シート【記載必須】'!$C$7","v":"市町村"},{"$f":"'2_個別入力シート（支援プログラム以外）'!FI18","v":"00:00:00"},{"$f":"'2_個別入力シート（支援プログラム以外）'!FJ18","v":"00:00:00"},{"$f":"'2_個別入力シート（支援プログラム以外）'!FK18","v":0}]
[null,null,null,"⑬",{"$f":"IF('2_個別入力シート（支援プログラム以外）'!I19<>\"\",'2_個別入力シート（支援プログラム以外）'!I19,\"\")","v":""},{"$f":"IF('2_個別入力シート（支援プログラム以外）'!J19<>\"\",'2_個別入力シート（支援プログラム以外）'!J19,\"\")","v":""},{"$f":"IF('2_個別入力シート（支援プログラム以外）'!K19<>\"\",'2_個別入力シート（支援プログラム以外）'!K19,\"\")","v":""},{"$f":"IF('2_個別入力シート（支援プログラム以外）'!L19<>\"\",'2_個別入力シート（支援プログラム以外）'!L19,\"\")","v":""},{"$f":"IF('2_個別入力シート（支援プログラム以外）'!M19<>\"\",'2_個別入力シート（支援プログラム以外）'!M19,\"\")","v":""},{"$f":"IF('2_個別入力シート（支援プログラム以外）'!N19<>\"\",'2_個別入力シート（支援プログラム以外）'!N19,\"\")","v":""},{"$f":"'2_個別入力シート（支援プログラム以外）'!O19","v":0},{"$f":"'2_個別入力シート（支援プログラム以外）'!P19","v":0},{"$f":"'2_個別入力シート（支援プログラム以外）'!Q19","v":0},null,null,null,null,null,null,null,{"$f":"'1_共通入力シート【記載必須】'!$B$7","v":"433641"},{"$f":"IF('1_共通入力シート【記載必須】'!$E$7=\"\",'1_共通入力シート【記載必須】'!$D$7,'1_共通入力シート【記載必須】'!$E$7)","v":"玉東町"},{"$f":"'1_共通入力シート【記載必須】'!$C$7","v":"市町村"},{"$f":"'2_個別入力シート（支援プログラム以外）'!FI19","v":"00:00:00"},{"$f":"'2_個別入力シート（支援プログラム以外）'!FJ19","v":"00:00:00"},{"$f":"'2_個別入力シート（支援プログラム以外）'!FK19","v":0}]
[null,null,null,"⑭",{"$f":"IF('2_個別入力シート（支援プログラム以外）'!I20<>\"\",'2_個別入力シート（支援プログラム以外）'!I20,\"\")","v":""},{"$f":"IF('2_個別入力シート（支援プログラム以外）'!J20<>\"\",'2_個別入力シート（支援プログラム以外）'!J20,\"\")","v":""},{"$f":"IF('2_個別入力シート（支援プログラム以外）'!K20<>\"\",'2_個別入力シート（支援プログラム以外）'!K20,\"\")","v":""},{"$f":"IF('2_個別入力シート（支援プログラム以外）'!L20<>\"\",'2_個別入力シート（支援プログラム以外）'!L20,\"\")","v":""},{"$f":"IF('2_個別入力シート（支援プログラム以外）'!M20<>\"\",'2_個別入力シート（支援プログラム以外）'!M20,\"\")","v":""},{"$f":"IF('2_個別入力シート（支援プログラム以外）'!N20<>\"\",'2_個別入力シート（支援プログラム以外）'!N20,\"\")","v":""},{"$f":"'2_個別入力シート（支援プログラム以外）'!O20","v":0},{"$f":"'2_個別入力シート（支援プログラム以外）'!P20","v":0},{"$f":"'2_個別入力シート（支援プログラム以外）'!Q20","v":0},null,null,null,null,null,null,null,{"$f":"'1_共通入力シート【記載必須】'!$B$7","v":"433641"},{"$f":"IF('1_共通入力シート【記載必須】'!$E$7=\"\",'1_共通入力シート【記載必須】'!$D$7,'1_共通入力シート【記載必須】'!$E$7)","v":"玉東町"},{"$f":"'1_共通入力シート【記載必須】'!$C$7","v":"市町村"},{"$f":"'2_個別入力シート（支援プログラム以外）'!FI20","v":"00:00:00"},{"$f":"'2_個別入力シート（支援プログラム以外）'!FJ20","v":"00:00:00"},{"$f":"'2_個別入力シート（支援プログラム以外）'!FK20","v":0}]
[null,null,null,"⑮",{"$f":"IF('2_個別入力シート（支援プログラム以外）'!I21<>\"\",'2_個別入力シート（支援プログラム以外）'!I21,\"\")","v":""},{"$f":"IF('2_個別入力シート（支援プログラム以外）'!J21<>\"\",'2_個別入力シート（支援プログラム以外）'!J21,\"\")","v":""},{"$f":"IF('2_個別入力シート（支援プログラム以外）'!K21<>\"\",'2_個別入力シート（支援プログラム以外）'!K21,\"\")","v":""},{"$f":"IF('2_個別入力シート（支援プログラム以外）'!L21<>\"\",'2_個別入力シート（支援プログラム以外）'!L21,\"\")","v":""},{"$f":"IF('2_個別入力シート（支援プログラム以外）'!M21<>\"\",'2_個別入力シート（支援プログラム以外）'!M21,\"\")","v":""},{"$f":"IF('2_個別入力シート（支援プログラム以外）'!N21<>\"\",'2_個別入力シート（支援プログラム以外）'!N21,\"\")","v":""},{"$f":"'2_個別入力シート（支援プログラム以外）'!O21","v":0},{"$f":"'2_個別入力シート（支援プログラム以外）'!P21","v":0},{"$f":"'2_個別入力シート（支援プログラム以外）'!Q21","v":0},null,null,null,null,null,null,null,{"$f":"'1_共通入力シート【記載必須】'!$B$7","v":"433641"},{"$f":"IF('1_共通入力シート【記載必須】'!$E$7=\"\",'1_共通入力シート【記載必須】'!$D$7,'1_共通入力シート【記載必須】'!$E$7)","v":"玉東町"},{"$f":"'1_共通入力シート【記載必須】'!$C$7","v":"市町村"},{"$f":"'2_個別入力シート（支援プログラム以外）'!FI21","v":"00:00:00"},{"$f":"'2_個別入力シート（支援プログラム以外）'!FJ21","v":"00:00:00"},{"$f":"'2_個別入力シート（支援プログラム以外）'!FK21","v":0}]
[null,null,null,"⑯",{"$f":"IF('2_個別入力シート（支援プログラム以外）'!I22<>\"\",'2_個別入力シート（支援プログラム以外）'!I22,\"\")","v":""},{"$f":"IF('2_個別入力シート（支援プログラム以外）'!J22<>\"\",'2_個別入力シート（支援プログラム以外）'!J22,\"\")","v":""},{"$f":"IF('2_個別入力シート（支援プログラム以外）'!K22<>\"\",'2_個別入力シート（支援プログラム以外）'!K22,\"\")","v":""},{"$f":"IF('2_個別入力シート（支援プログラム以外）'!L22<>\"\",'2_個別入力シート（支援プログラム以外）'!L22,\"\")","v":""},{"$f":"IF('2_個別入力シート（支援プログラム以外）'!M22<>\"\",'2_個別入力シート（支援プログラム以外）'!M22,\"\")","v":""},{"$f":"IF('2_個別入力シート（支援プログラム以外）'!N22<>\"\",'2_個別入力シート（支援プログラム以外）'!N22,\"\")","v":""},{"$f":"'2_個別入力シート（支援プログラム以外）'!O22","v":0},{"$f":"'2_個別入力シート（支援プログラム以外）'!P22","v":0},{"$f":"'2_個別入力シート（支援プログラム以外）'!Q22","v":0},null,null,null,null,null,null,null,{"$f":"'1_共通入力シート【記載必須】'!$B$7","v":"433641"},{"$f":"IF('1_共通入力シート【記載必須】'!$E$7=\"\",'1_共通入力シート【記載必須】'!$D$7,'1_共通入力シート【記載必須】'!$E$7)","v":"玉東町"},{"$f":"'1_共通入力シート【記載必須】'!$C$7","v":"市町村"},{"$f":"'2_個別入力シート（支援プログラム以外）'!FI22","v":"00:00:00"},{"$f":"'2_個別入力シート（支援プログラム以外）'!FJ22","v":"00:00:00"},{"$f":"'2_個別入力シート（支援プログラム以外）'!FK22","v":0}]
[null,null,null,"⑰",{"$f":"IF('2_個別入力シート（支援プログラム以外）'!I23<>\"\",'2_個別入力シート（支援プログラム以外）'!I23,\"\")","v":""},{"$f":"IF('2_個別入力シート（支援プログラム以外）'!J23<>\"\",'2_個別入力シート（支援プログラム以外）'!J23,\"\")","v":""},{"$f":"IF('2_個別入力シート（支援プログラム以外）'!K23<>\"\",'2_個別入力シート（支援プログラム以外）'!K23,\"\")","v":""},{"$f":"IF('2_個別入力シート（支援プログラム以外）'!L23<>\"\",'2_個別入力シート（支援プログラム以外）'!L23,\"\")","v":""},{"$f":"IF('2_個別入力シート（支援プログラム以外）'!M23<>\"\",'2_個別入力シート（支援プログラム以外）'!M23,\"\")","v":""},{"$f":"IF('2_個別入力シート（支援プログラム以外）'!N23<>\"\",'2_個別入力シート（支援プログラム以外）'!N23,\"\")","v":""},{"$f":"'2_個別入力シート（支援プログラム以外）'!O23","v":0},{"$f":"'2_個別入力シート（支援プログラム以外）'!P23","v":0},{"$f":"'2_個別入力シート（支援プログラム以外）'!Q23","v":0},null,null,null,null,null,null,null,{"$f":"'1_共通入力シート【記載必須】'!$B$7","v":"433641"},{"$f":"IF('1_共通入力シート【記載必須】'!$E$7=\"\",'1_共通入力シート【記載必須】'!$D$7,'1_共通入力シート【記載必須】'!$E$7)","v":"玉東町"},{"$f":"'1_共通入力シート【記載必須】'!$C$7","v":"市町村"},{"$f":"'2_個別入力シート（支援プログラム以外）'!FI23","v":"00:00:00"},{"$f":"'2_個別入力シート（支援プログラム以外）'!FJ23","v":"00:00:00"},{"$f":"'2_個別入力シート（支援プログラム以外）'!FK23","v":0}]
[null,null,null,"⑱",{"$f":"IF('2_個別入力シート（支援プログラム以外）'!I24<>\"\",'2_個別入力シート（支援プログラム以外）'!I24,\"\")","v":""},{"$f":"IF('2_個別入力シート（支援プログラム以外）'!J24<>\"\",'2_個別入力シート（支援プログラム以外）'!J24,\"\")","v":""},{"$f":"IF('2_個別入力シート（支援プログラム以外）'!K24<>\"\",'2_個別入力シート（支援プログラム以外）'!K24,\"\")","v":""},{"$f":"IF('2_個別入力シート（支援プログラム以外）'!L24<>\"\",'2_個別入力シート（支援プログラム以外）'!L24,\"\")","v":""},{"$f":"IF('2_個別入力シート（支援プログラム以外）'!M24<>\"\",'2_個別入力シート（支援プログラム以外）'!M24,\"\")","v":""},{"$f":"IF('2_個別入力シート（支援プログラム以外）'!N24<>\"\",'2_個別入力シート（支援プログラム以外）'!N24,\"\")","v":""},{"$f":"'2_個別入力シート（支援プログラム以外）'!O24","v":0},{"$f":"'2_個別入力シート（支援プログラム以外）'!P24","v":0},{"$f":"'2_個別入力シート（支援プログラム以外）'!Q24","v":0},null,null,null,null,null,null,null,{"$f":"'1_共通入力シート【記載必須】'!$B$7","v":"433641"},{"$f":"IF('1_共通入力シート【記載必須】'!$E$7=\"\",'1_共通入力シート【記載必須】'!$D$7,'1_共通入力シート【記載必須】'!$E$7)","v":"玉東町"},{"$f":"'1_共通入力シート【記載必須】'!$C$7","v":"市町村"},{"$f":"'2_個別入力シート（支援プログラム以外）'!FI24","v":"00:00:00"},{"$f":"'2_個別入力シート（支援プログラム以外）'!FJ24","v":"00:00:00"},{"$f":"'2_個別入力シート（支援プログラム以外）'!FK24","v":0}]
[null,null,null,"⑲",{"$f":"IF('2_個別入力シート（支援プログラム以外）'!I25<>\"\",'2_個別入力シート（支援プログラム以外）'!I25,\"\")","v":""},{"$f":"IF('2_個別入力シート（支援プログラム以外）'!J25<>\"\",'2_個別入力シート（支援プログラム以外）'!J25,\"\")","v":""},{"$f":"IF('2_個別入力シート（支援プログラム以外）'!K25<>\"\",'2_個別入力シート（支援プログラム以外）'!K25,\"\")","v":""},{"$f":"IF('2_個別入力シート（支援プログラム以外）'!L25<>\"\",'2_個別入力シート（支援プログラム以外）'!L25,\"\")","v":""},{"$f":"IF('2_個別入力シート（支援プログラム以外）'!M25<>\"\",'2_個別入力シート（支援プログラム以外）'!M25,\"\")","v":""},{"$f":"IF('2_個別入力シート（支援プログラム以外）'!N25<>\"\",'2_個別入力シート（支援プログラム以外）'!N25,\"\")","v":""},{"$f":"'2_個別入力シート（支援プログラム以外）'!O25","v":0},{"$f":"'2_個別入力シート（支援プログラム以外）'!P25","v":0},{"$f":"'2_個別入力シート（支援プログラム以外）'!Q25","v":0},null,null,null,null,null,null,null,{"$f":"'1_共通入力シート【記載必須】'!$B$7","v":"433641"},{"$f":"IF('1_共通入力シート【記載必須】'!$E$7=\"\",'1_共通入力シート【記載必須】'!$D$7,'1_共通入力シート【記載必須】'!$E$7)","v":"玉東町"},{"$f":"'1_共通入力シート【記載必須】'!$C$7","v":"市町村"},{"$f":"'2_個別入力シート（支援プログラム以外）'!FI25","v":"00:00:00"},{"$f":"'2_個別入力シート（支援プログラム以外）'!FJ25","v":"00:00:00"},{"$f":"'2_個別入力シート（支援プログラム以外）'!FK25","v":0}]
[null,null,null,{"$f":"'3_個別入力シート（支援プログラム）'!B7","v":"支援プ①"},{"$f":"IF('3_個別入力シート（支援プログラム）'!I7<>\"\",'3_個別入力シート（支援プログラム）'!I7,\"\")","v":"R7"},{"$f":"IF('3_個別入力シート（支援プログラム）'!J7<>\"\",'3_個別入力シート（支援プログラム）'!J7,\"\")","v":"結婚・妊娠・共育ての相談機会提供・支援プログラム"},{"$f":"IF('3_個別入力シート（支援プログラム）'!K7<>\"\",'3_個別入力シート（支援プログラム）'!K7,\"\")","v":"一般コース"},{"$f":"IF('3_個別入力シート（支援プログラム）'!L7<>\"\",'3_個別入力シート（支援プログラム）'!L7,\"\")","v":"4_1 結婚・妊娠・共育ての相談機会提供・支援プログラム（一般コース）"},{"$f":"IF('3_個別入力シート（支援プログラム）'!M7<>\"\",'3_個別入力シート（支援プログラム）'!M7,\"\")","v":"玉東町結婚新生活支援事業"},{"$f":"IF('3_個別入力シート（支援プログラム）'!N7<>\"\",'3_個別入力シート（支援プログラム）'!N7,\"\")","v":0.5},{"$f":"'3_個別入力シート（支援プログラム）'!O7","v":2400000},{"$f":"'3_個別入力シート（支援プログラム）'!P7","v":0},{"$f":"'3_個別入力シート（支援プログラム）'!Q7","v":2400000},null,{"$f":"P24+Q24","v":4},{"$f":"'3_個別入力シート（支援プログラム）'!AN7","v":2},{"$f":"'3_個別入力シート（支援プログラム）'!AO7","v":2},{"$f":"'3_個別入力シート（支援プログラム）'!AQ7","v":2},{"$f":"'3_個別入力シート（支援プログラム）'!AV7","v":600000},null,{"$f":"'1_共通入力シート【記載必須】'!$B$7","v":"433641"},{"$f":"IF('1_共通入力シート【記載必須】'!$E$7=\"\",'1_共通入力シート【記載必須】'!$D$7,'1_共通入力シート【記載必須】'!$E$7)","v":"玉東町"},{"$f":"'1_共通入力シート【記載必須】'!$C$7","v":"市町村"},{"$f":"'3_個別入力シート（支援プログラム）'!CO7","v":"2026-03-31"},{"$f":"'3_個別入力シート（支援プログラム）'!CP7","v":"00:00:00"},{"$f":"'3_個別入力シート（支援プログラム）'!CQ7","v":0}]

{"sheet":"個票①（支援プログラム以外）","index":4,"n_rows":116,"n_cols":42,"rows_kept":116,"cut":false,"hidden":false,"merged":[[28,26,28,30],[29,26,29,30],[9,0,10,6],[9,7,10,35],[11,0,12,6],[11,7,12,35],[4,13,4,18],[5,13,5,18],[5,19,5,34],[13,0,15,6],[13,7,15,26],[13,27,15,30],[13,31,15,35],[22,21,22,25],[22,26,22,30],[22,31,22,35],[24,7,24,10],[24,11,24,15],[25,21,25,25],[20,7,21,35],[25,11,25,15],[25,16,25,20],[23,31,23,35],[23,7,23,10],[40,0,87,1],[54,9,57,35],[58,9,61,35],[62,9,65,35],[29,11,29,15],[29,16,29,20],[29,21,29,25],[29,31,29,35],[26,11,26,15],[26,16,26,20],[26,21,26,25],[26,31,26,35],[27,11,27,15],[27,16,27,20],[27,21,27,25],[27,31,27,35],[27,2,27,6],[26,26,26,30],[27,26,27,30],[58,4,61,8],[50,2,53,3],[82,2,82,35],[74,9,77,35],[78,9,81,35],[0,0,0,8],[0,32,0,34],[0,38,0,39],[1,38,3,39],[2,4,2,11],[2,12,2,26],[2,27,2,32],[7,0,8,6],[7,7,8,35],[4,19,4,33],[18,38,19,38],[23,26,23,30],[16,18,17,26],[16,27,17,30],[40,2,41,3],[40,4,41,8],[16,0,17,6],[16,7,17,15],[16,16,17,17],[18,0,19,6],[18,7,19,15],[18,16,19,21],[18,22,19,26],[18,27,19,30],[18,31,19,35],[24,26,24,30],[24,16,24,20],[40,9,41,35],[18,36,19,36],[20,36,21,36],[24,31,24,35],[20,0,21,6],[22,11,22,15],[22,16,22,20],[90,24,90,25],[50,4,53,8],[54,2,57,3],[54,4,57,8],[42,2,45,3],[42,4,45,8],[62,2,65,3],[62,4,65,8],[18,37,19,37],[25,26,25,30],[25,31,25,35],[28,2,28,6],[29,2,29,6],[22,7,22,10],[26,7,26,10],[22,2,22,6],[23,2,23,6],[24,2,24,6],[25,2,25,6],[26,2,26,6],[28,11,28,15],[28,16,28,20],[28,21,28,25],[58,2,61,3],[23,16,23,20],[23,21,23,25],[66,2,69,3],[66,4,69,8],[78,2,81,3],[78,4,81,8],[24,21,24,25],[46,2,49,3],[46,4,49,8],[31,7,31,35],[32,7,35,35],[36,7,36,35],[37,7,39,35],[28,31,28,35],[42,9,45,35],[46,9,49,35],[50,9,53,35],[28,7,28,10],[30,2,30,6],[30,7,30,35],[70,2,73,3],[70,4,73,8],[74,2,77,3],[74,4,77,8],[66,9,69,35],[70,9,73,35],[90,26,90,30],[90,31,90,35],[88,0,93,6],[88,7,88,23],[88,24,88,25],[88,26,88,30],[88,31,88,35],[89,7,89,23],[89,24,89,25],[91,31,91,35],[92,7,92,23],[92,24,92,25],[92,26,92,30],[92,31,92,35],[93,7,93,23],[93,24,93,25],[93,26,93,30],[93,31,93,35],[91,7,91,23],[91,24,91,25],[91,26,91,30],[89,26,89,30],[89,31,89,35],[90,7,90,23],[104,31,104,35],[104,9,104,23],[94,0,97,6],[94,7,94,23],[94,24,94,25],[94,26,94,35],[95,7,95,23],[95,24,95,25],[95,26,95,35],[96,7,96,23],[96,24,96,25],[96,26,96,35],[97,7,97,23],[97,24,97,25],[97,26,97,35],[103,7,103,8],[100,31,100,35],[98,7,98,23],[98,24,98,25],[98,26,98,30],[98,31,98,35],[99,7,99,8],[99,9,99,23],[101,24,101,25],[101,26,101,30],[101,31,101,35],[99,24,99,25],[99,26,99,30],[99,31,99,35],[100,7,100,8],[100,9,100,23],[100,24,100,25],[100,26,100,30],[101,7,101,8],[101,9,101,23],[104,24,104,25],[102,9,102,23],[112,24,112,25],[112,26,112,30],[112,31,112,35],[111,7,111,8],[111,9,111,23],[112,7,112,8],[105,7,105,8],[105,26,105,30],[105,31,105,35],[105,9,105,23],[105,24,105,25],[110,31,110,35],[102,24,102,25],[102,26,102,30],[102,31,102,35],[110,26,110,30],[112,9,112,23],[106,7,106,8],[106,9,106,23],[106,24,106,25],[106,26,106,30],[106,31,106,35],[98,0,114,6],[113,7,113,8],[113,26,113,30],[113,31,113,35],[114,7,114,8],[114,26,114,30],[107,7,107,8],[107,9,107,23],[107,24,107,25],[107,26,107,30],[107,31,107,35],[113,24,113,25],[111,24,111,25],[111,26,111,30],[111,31,111,35],[110,7,110,8],[110,9,110,23],[110,24,110,25],[103,9,103,23],[103,24,103,25],[103,26,103,30],[103,31,103,35],[104,7,104,8],[104,26,104,30],[16,36,17,36],[114,31,114,35],[108,7,108,8],[108,9,108,23],[108,24,108,25],[108,26,108,30],[108,31,108,35],[109,7,109,8],[109,9,109,23],[109,24,109,25],[109,26,109,30],[109,31,109,35],[113,9,113,23],[114,9,114,23],[114,24,114,25],[16,31,17,35],[25,7,25,10],[27,7,27,10],[102,7,102,8],[29,7,29,10],[23,11,23,15],[83,2,87,35],[31,0,39,6],[22,0,30,1]]}
["別紙様式第１　様式２",null,null,null,null,null,null,null,null,null,null,null,null,null,null,null,null,null,null,null,null,null,null,null,null,null,null,null,null,null,null,"個票","①",null,null,null,"データ整理用欄"]
[]
[null,null,null,null,{"$f":"IF(AK3=\"R8\",\"（令和８年度予算分）\",IF(AK3=\"R7\",\"（令和７年度予算分）\",\"\"))","v":""},null,null,null,null,null,null,null,"地域少子化対策重点推進交付金　実施計画書",null,null,null,null,null,null,null,null,null,null,null,null,null,null,{"$f":"IF(AL3=\"都道府県\",\"（都道府県分）\",IF(AL3=\"政令指定都市\",\"（市町村分）\",IF(AL3=\"市町村\",\"（市町村分）\",\"\")))","v":"（市町村分）"},null,null,null,null,null,"個票",null,null,{"$f":"VLOOKUP(AG1,'2_個別入力シート（支援プログラム以外）'!$B$7:$GI$25,'2_個別入力シート（支援プログラム以外）'!I6,0)","v":0},{"$f":"VLOOKUP(AG1,'2_個別入力シート（支援プログラム以外）'!$B$7:$GI$25,'2_個別入力シート（支援プログラム以外）'!D6,0)","v":"市町村"}]
[]
[null,null,null,null,null,null,null,null,null,null,null,null,null,"自治体名",null,null,null,null,null,{"$f":"VLOOKUP(AG1,'2_個別入力シート（支援プログラム以外）'!$B$7:$GI$25,'2_個別入力シート（支援プログラム以外）'!G6,0)& \"\"","v":"熊本県玉東町"}]
[null,null,null,null,null,null,null,null,null,null,null,null,null,"本事業の担当部局名",null,null,null,null,null,{"$f":"VLOOKUP(AG1,'2_個別入力シート（支援プログラム以外）'!$B$7:$GI$25,'2_個別入力シート（支援プログラム以外）'!H6,0)& \"\"","v":""}]
[]
["事業メニュー",null,null,null,null,null,null,{"$f":"VLOOKUP(AG1,'2_個別入力シート（支援プログラム以外）'!$B$7:$GI$25,'2_個別入力シート（支援プログラム以外）'!J6,0)","v":0}]
[]
["区分",null,null,null,null,null,null,{"$f":"VLOOKUP(AG1,'2_個別入力シート（支援プログラム以外）'!$B$7:$GI$25,'2_個別入力シート（支援プログラム以外）'!K6,0)","v":0}]
[]
["関連事業メニュー",null,null,null,null,null,null,{"$f":"VLOOKUP(AG1,'2_個別入力シート（支援プログラム以外）'!$B$7:$GI$25,'2_個別入力シート（支援プログラム以外）'!L6,0)","v":0}]
[]
["個別事業名",null,null,null,null,null,null,{"$f":"VLOOKUP(AG1,'2_個別入力シート（支援プログラム以外）'!$B$7:$GI$25,'2_個別入力シート（支援プログラム以外）'!M6,0)","v":0},null,null,null,null,null,null,null,null,null,null,null,null,null,null,null,null,null,null,null,"新規／継続\n(一般財源での\n実施も含む)",null,null,null,{"$f":"VLOOKUP(AG1,'2_個別入力シート（支援プログラム以外）'!$B$7:$GI$25,'2_個別入力シート（支援プログラム以外）'!BE6,0)","v":0}]
[]
[]
["実施期間",null,null,null,null,null,null,{"$f":"VLOOKUP(AG1,'2_個別入力シート（支援プログラム以外）'!$B$7:$GI$25,'2_個別入力シート（支援プログラム以外）'!BC6,0) &\"\"","v":""},null,null,null,null,null,null,null,null,"～",null,{"$f":"VLOOKUP(AG1,'2_個別入力シート（支援プログラム以外）'!$B$7:$GI$25,'2_個別入力シート（支援プログラム以外）'!BD6,0) &\"\"","v":""},null,null,null,null,null,null,null,null,"事業開始年度",null,null,null,{"$f":"DATEVALUE(AK17&\"年12月31日\")","v":{"$error":"#VALUE!"}},null,null,null,null,{"$f":"VLOOKUP(AG1,'2_個別入力シート（支援プログラム以外）'!$B$7:$GI$25,'2_個別入力シート（支援プログラム以外）'!BF6,0)& \"\"","v":""}]
[]
["総事業費（Ａ）（円）",null,null,null,null,null,null,{"$f":"AK19*1","v":0},null,null,null,null,null,null,null,null,"寄付金その他の収入予定額（Ｂ）（円）",null,null,null,null,null,{"$f":"AL19*1","v":0},null,null,null,null,"差引額（Ａ-Ｂ）（円）",null,null,null,{"$f":"AM19*1","v":0},null,null,null,null,{"$f":"VLOOKUP(AG1,'2_個別入力シート（支援プログラム以外）'!$B$7:$GI$25,'2_個別入力シート（支援プログラム以外）'!O6,0)","v":0},{"$f":"VLOOKUP(AG1,'2_個別入力シート（支援プログラム以外）'!$B$7:$GI$25,'2_個別入力シート（支援プログラム以外）'!P6,0)","v":0},{"$f":"VLOOKUP(AG1,'2_個別入力シート（支援プログラム以外）'!$B$7:$GI$25,'2_個別入力シート（支援プログラム以外）'!R6,0)","v":0}]
[]
["対象経費支出予定額（円）\n※補助率を乗じる前の額",null,null,null,null,null,null,{"$f":"AK21*1","v":0},null,null,null,null,null,null,null,null,null,null,null,null,null,null,null,null,null,null,null,null,null,null,null,null,null,null,null,null,{"$f":"VLOOKUP(AG1,'2_個別入力シート（支援プログラム以外）'!$B$7:$GI$25,'2_個別入力シート（支援プログラム以外）'!Q6,0)","v":0}]
[]
["費用内訳（円）",null,"区分",null,null,null,null,"諸謝金",null,null,null,"賃金",null,null,null,null,"報償費",null,null,null,null,"旅費",null,null,null,null,"需用費",null,null,null,null,"役務費"]
[null,null,"総事業費",null,null,null,null,{"$f":"AK24*1","v":0},null,null,null,{"$f":"AL24*1","v":0},null,null,null,null,{"$f":"AM24*1","v":0},null,null,null,null,{"$f":"AN24*1","v":0},null,null,null,null,{"$f":"AO24*1","v":0},null,null,null,null,{"$f":"AP24*1","v":0},null,null,null,null,{"$f":"VLOOKUP(AG1,'2_個別入力シート（支援プログラム以外）'!$B$7:$GI$25,'2_個別入力シート（支援プログラム以外）'!S6,0)","v":0},{"$f":"VLOOKUP(AG1,'2_個別入力シート（支援プログラム以外）'!$B$7:$GI$25,'2_個別入力シート（支援プログラム以外）'!V6,0)","v":0},{"$f":"VLOOKUP(AG1,'2_個別入力シート（支援プログラム以外）'!$B$7:$GI$25,'2_個別入力シート（支援プログラム以外）'!Y6,0)","v":0},{"$f":"VLOOKUP(AG1,'2_個別入力シート（支援プログラム以外）'!$B$7:$GI$25,'2_個別入力シート（支援プログラム以外）'!AB6,0)","v":0},{"$f":"VLOOKUP(AG1,'2_個別入力シート（支援プログラム以外）'!$B$7:$GI$25,'2_個別入力シート（支援プログラム以外）'!AE6,0)","v":0},{"$f":"VLOOKUP(AG1,'2_個別入力シート（支援プログラム以外）'!$B$7:$GI$25,'2_個別入力シート（支援プログラム以外）'!AH6,0)","v":0}]
[null,null,"対象経費支出予定額",null,null,null,null,{"$f":"AK25*1","v":0},null,null,null,{"$f":"AL25*1","v":0},null,null,null,null,{"$f":"AM25*1","v":0},null,null,null,null,{"$f":"AN25*1","v":0},null,null,null,null,{"$f":"AO25*1","v":0},null,null,null,null,{"$f":"AP25*1","v":0},null,null,null,null,{"$f":"VLOOKUP(AG1,'2_個別入力シート（支援プログラム以外）'!$B$7:$GI$25,'2_個別入力シート（支援プログラム以外）'!T6,0)","v":0},{"$f":"VLOOKUP(AG1,'2_個別入力シート（支援プログラム以外）'!$B$7:$GI$25,'2_個別入力シート（支援プログラム以外）'!W6,0)","v":0},{"$f":"VLOOKUP(AG1,'2_個別入力シート（支援プログラム以外）'!$B$7:$GI$25,'2_個別入力シート（支援プログラム以外）'!Z6,0)","v":0},{"$f":"VLOOKUP(AG1,'2_個別入力シート（支援プログラム以外）'!$B$7:$GI$25,'2_個別入力シート（支援プログラム以外）'!AC6,0)","v":0},{"$f":"VLOOKUP(AG1,'2_個別入力シート（支援プログラム以外）'!$B$7:$GI$25,'2_個別入力シート（支援プログラム以外）'!AF6,0)","v":0},{"$f":"VLOOKUP(AG1,'2_個別入力シート（支援プログラム以外）'!$B$7:$GI$25,'2_個別入力シート（支援プログラム以外）'!AI6,0)","v":0}]
[null,null,"対象外経費支出予定額",null,null,null,null,0,null,null,null,0,null,null,null,null,0,null,null,null,null,0,null,null,null,null,0,null,null,null,null,0,null,null,null,null,{"$f":"VLOOKUP(AG1,'2_個別入力シート（支援プログラム以外）'!$B$7:$GI$25,'2_個別入力シート（支援プログラム以外）'!U6,0)","v":0},{"$f":"VLOOKUP(AG1,'2_個別入力シート（支援プログラム以外）'!$B$7:$GI$25,'2_個別入力シート（支援プログラム以外）'!X6,0)","v":0},{"$f":"VLOOKUP(AG1,'2_個別入力シート（支援プログラム以外）'!$B$7:$GI$25,'2_個別入力シート（支援プログラム以外）'!AA6,0)","v":0},{"$f":"VLOOKUP(AG1,'2_個別入力シート（支援プログラム以外）'!$B$7:$GI$25,'2_個別入力シート（支援プログラム以外）'!AD6,0)","v":0},{"$f":"VLOOKUP(AG1,'2_個別入力シート（支援プログラム以外）'!$B$7:$GI$25,'2_個別入力シート（支援プログラム以外）'!AG6,0)","v":0},{"$f":"VLOOKUP(AG1,'2_個別入力シート（支援プログラム以外）'!$B$7:$GI$25,'2_個別入力シート（支援プログラム以外）'!AJ6,0)","v":0}]
[null,null,"区分",null,null,null,null,"委託料",null,null,null,"使用料及び賃借料",null,null,null,null,"負担金",null,null,null,null,"補助金",null,null,null,null,null,null,null,null,null,"計"]
[null,null,"総事業費",null,null,null,null,{"$f":"AK28*1","v":0},null,null,null,{"$f":"AL28*1","v":0},null,null,null,null,{"$f":"AM28*1","v":0},null,null,null,null,{"$f":"AN28*1","v":0},null,null,null,null,null,null,null,null,null,{"$f":"AP28*1","v":0},null,null,null,null,{"$f":"VLOOKUP(AG1,'2_個別入力シート（支援プログラム以外）'!$B$7:$GI$25,'2_個別入力シート（支援プログラム以外）'!AK6,0)","v":0},{"$f":"VLOOKUP(AG1,'2_個別入力シート（支援プログラム以外）'!$B$7:$GI$25,'2_個別入力シート（支援プログラム以外）'!AN6,0)","v":0},{"$f":"VLOOKUP(AG1,'2_個別入力シート（支援プログラム以外）'!$B$7:$GI$25,'2_個別入力シート（支援プログラム以外）'!AQ6,0)","v":0},{"$f":"VLOOKUP(AG1,'2_個別入力シート（支援プログラム以外）'!$B$7:$GI$25,'2_個別入力シート（支援プログラム以外）'!AT6,0)","v":0},null,{"$f":"VLOOKUP(AG1,'2_個別入力シート（支援プログラム以外）'!$B$7:$GI$25,'2_個別入力シート（支援プログラム以外）'!AZ6,0)& \"\"","v":"0"}]
[null,null,"対象経費支出予定額",null,null,null,null,{"$f":"AK29*1","v":0},null,null,null,{"$f":"AL29*1","v":0},null,null,null,null,{"$f":"AM29*1","v":0},null,null,null,null,{"$f":"AN29*1","v":0},null,null,null,null,null,null,null,null,null,{"$f":"AP29*1","v":0},null,null,null,null,{"$f":"VLOOKUP(AG1,'2_個別入力シート（支援プログラム以外）'!$B$7:$GI$25,'2_個別入力シート（支援プログラム以外）'!AL6,0)","v":0},{"$f":"VLOOKUP(AG1,'2_個別入力シート（支援プログラム以外）'!$B$7:$GI$25,'2_個別入力シート（支援プログラム以外）'!AO6,0)","v":0},{"$f":"VLOOKUP(AG1,'2_個別入力シート（支援プログラム以外）'!$B$7:$GI$25,'2_個別入力シート（支援プログラム以外）'!AR6,0)","v":0},{"$f":"VLOOKUP(AG1,'2_個別入力シート（支援プログラム以外）'!$B$7:$GI$25,'2_個別入力シート（支援プログラム以外）'!AU6,0)","v":0},null,{"$f":"VLOOKUP(AG1,'2_個別入力シート（支援プログラム以外）'!$B$7:$GI$25,'2_個別入力シート（支援プログラム以外）'!BA6,0)& \"\"","v":"0"}]
[null,null,"対象外経費支出予定額",null,null,null,null,0,null,null,null,0,null,null,null,null,0,null,null,null,null,0,null,null,null,null,null,null,null,null,null,0,null,null,null,null,{"$f":"VLOOKUP(AG1,'2_個別入力シート（支援プログラム以外）'!$B$7:$GI$25,'2_個別入力シート（支援プログラム以外）'!AM6,0)","v":0},{"$f":"VLOOKUP(AG1,'2_個別入力シート（支援プログラム以外）'!$B$7:$GI$25,'2_個別入力シート（支援プログラム以外）'!AP6,0)","v":0},{"$f":"VLOOKUP(AG1,'2_個別入力シート（支援プログラム以外）'!$B$7:$GI$25,'2_個別入力シート（支援プログラム以外）'!AS6,0)","v":0},{"$f":"VLOOKUP(AG1,'2_個別入力シート（支援プログラム以外）'!$B$7:$GI$25,'2_個別入力シート（支援プログラム以外）'!AV6,0)","v":0},null,{"$f":"VLOOKUP(AG1,'2_個別入力シート（支援プログラム以外）'!$B$7:$GI$25,'2_個別入力シート（支援プログラム以外）'!BB6,0)& \"\"","v":"0"}]
[null,null,{"$f":"IF(OR(AK31=\"NG\",AL31=\"NG\"),\"---\",\"〇\")","v":"---"},null,null,null,null,"※上記対象経費支出予定額に本交付金の対象外となる経費は含まれていない。",null,null,null,null,null,null,null,null,null,null,null,null,null,null,null,null,null,null,null,null,null,null,null,null,null,null,null,null,{"$f":"VLOOKUP(AG1,'2_個別入力シート（支援プログラム以外）'!$B$7:$GI$25,'2_個別入力シート（支援プログラム以外）'!FL6,0)& \"\"","v":"NG"},{"$f":"VLOOKUP(AG1,'2_個別入力シート（支援プログラム以外）'!$B$7:$GI$25,'2_個別入力シート（支援プログラム以外）'!FY6,0)& \"\"","v":"OK"}]
["自治体における少子化対策の全体像及びその中での本個別事業の位置付け",null,null,null,null,null,null,"＜自治体における少子化対策の全体像＞※全事業共通\n\n\n\n\n"]
[null,null,null,null,null,null,null,{"$f":"_xlfn.XLOOKUP(AG1, '2_個別入力シート（支援プログラム以外）'!$B$7:$B$25, '2_個別入力シート（支援プログラム以外）'!BI$7:BI$25, \"\")","v":"　結婚・妊娠・共育ての相談機会提供・支援プログラムを実施し、結婚に伴う新生活を経済的に支援するため新生活費用に対して補助を行う。\n　また、荒尾・玉名地域結婚サポートセンター（有明広域行政事務組合）と連携して婚活事業を実施し、出会いの場の創出を重点的に行う。事業実施後には、対象者にアンケート調査等を行い、次年度以降により効果的な取組を行えるように留意する。"}]
[]
[]
[]
[null,null,null,null,null,null,null,"＜本個別事業の位置付け＞"]
[null,null,null,null,null,null,null,{"$f":"_xlfn.XLOOKUP(AG1, '2_個別入力シート（支援プログラム以外）'!$B$7:$B$25, '2_個別入力シート（支援プログラム以外）'!BJ$7:BJ$25, \"\")","v":0}]
[]
[]
["個別事業の内容",null,"番号",null,"項目",null,null,null,null,"内容"]
[]
[null,null,1,null,{"$f":"VLOOKUP(AG1,'2_個別入力シート（支援プログラム以外）'!$B$7:$GI$25,'2_個別入力シート（支援プログラム以外）'!BK6,0)& \"\"","v":""},null,null,null,null,{"$f":"VLOOKUP(AG1,'2_個別入力シート（支援プログラム以外）'!$B$7:$GI$25,'2_個別入力シート（支援プログラム以外）'!BL6,0)& \"\"","v":""}]
[]
[]
[]
[null,null,2,null,{"$f":"VLOOKUP(AG1,'2_個別入力シート（支援プログラム以外）'!$B$7:$GI$25,'2_個別入力シート（支援プログラム以外）'!BM6,0)& \"\"","v":""},null,null,null,null,{"$f":"VLOOKUP(AG1,'2_個別入力シート（支援プログラム以外）'!$B$7:$GI$25,'2_個別入力シート（支援プログラム以外）'!BN6,0)& \"\"","v":""}]
[]
[]
[]
[null,null,3,null,{"$f":"VLOOKUP(AG1,'2_個別入力シート（支援プログラム以外）'!$B$7:$GI$25,'2_個別入力シート（支援プログラム以外）'!BO6,0)& \"\"","v":""},null,null,null,null,{"$f":"VLOOKUP(AG1,'2_個別入力シート（支援プログラム以外）'!$B$7:$GI$25,'2_個別入力シート（支援プログラム以外）'!BP6,0)& \"\"","v":""}]
[]
[]
[]
[null,null,4,null,{"$f":"VLOOKUP(AG1,'2_個別入力シート（支援プログラム以外）'!$B$7:$GI$25,'2_個別入力シート（支援プログラム以外）'!BQ6,0)& \"\"","v":""},null,null,null,null,{"$f":"VLOOKUP(AG1,'2_個別入力シート（支援プログラム以外）'!$B$7:$GI$25,'2_個別入力シート（支援プログラム以外）'!BR6,0)& \"\"","v":""}]
[]
[]
[]
[null,null,5,null,{"$f":"VLOOKUP(AG1,'2_個別入力シート（支援プログラム以外）'!$B$7:$GI$25,'2_個別入力シート（支援プログラム以外）'!BS6,0)& \"\"","v":""},null,null,null,null,{"$f":"VLOOKUP(AG1,'2_個別入力シート（支援プログラム以外）'!$B$7:$GI$25,'2_個別入力シート（支援プログラム以外）'!BT6,0)& \"\"","v":""}]
[]
[]
[]
[null,null,6,null,{"$f":"VLOOKUP(AG1,'2_個別入力シート（支援プログラム以外）'!$B$7:$GI$25,'2_個別入力シート（支援プログラム以外）'!BU6,0)& \"\"","v":""},null,null,null,null,{"$f":"VLOOKUP(AG1,'2_個別入力シート（支援プログラム以外）'!$B$7:$GI$25,'2_個別入力シート（支援プログラム以外）'!BV6,0)& \"\"","v":""}]
[]
[]
[]
[null,null,7,null,{"$f":"VLOOKUP(AG1,'2_個別入力シート（支援プログラム以外）'!$B$7:$GI$25,'2_個別入力シート（支援プログラム以外）'!BW6,0)& \"\"","v":""},null,null,null,null,{"$f":"VLOOKUP(AG1,'2_個別入力シート（支援プログラム以外）'!$B$7:$GI$25,'2_個別入力シート（支援プログラム以外）'!BX6,0)& \"\"","v":""}]
[]
[]
[]
[null,null,8,null,{"$f":"VLOOKUP(AG1,'2_個別入力シート（支援プログラム以外）'!$B$7:$GI$25,'2_個別入力シート（支援プログラム以外）'!BY6,0)& \"\"","v":""},null,null,null,null,{"$f":"VLOOKUP(AG1,'2_個別入力シート（支援プログラム以外）'!$B$7:$GI$25,'2_個別入力シート（支援プログラム以外）'!BZ6,0)& \"\"","v":""}]
[]
[]
[]
[null,null,9,null,{"$f":"VLOOKUP(AG1,'2_個別入力シート（支援プログラム以外）'!$B$7:$GI$25,'2_個別入力シート（支援プログラム以外）'!CA6,0)& \"\"","v":""},null,null,null,null,{"$f":"VLOOKUP(AG1,'2_個別入力シート（支援プログラム以外）'!$B$7:$GI$25,'2_個別入力シート（支援プログラム以外）'!CB6,0)& \"\"","v":""}]
[]
[]
[]
[null,null,10,null,{"$f":"VLOOKUP(AG1,'2_個別入力シート（支援プログラム以外）'!$B$7:$GI$25,'2_個別入力シート（支援プログラム以外）'!CC6,0)& \"\"","v":""},null,null,null,null,{"$f":"VLOOKUP(AG1,'2_個別入力シート（支援プログラム以外）'!$B$7:$GI$25,'2_個別入力シート（支援プログラム以外）'!CD6,0)& \"\"","v":""}]
[]
[]
[]
[null,null,"＜過年度の本個別事業で浮かび上がった課題の分析及びそれに対する取組（ステップアップ）＞"]
[null,null,{"$f":"VLOOKUP(AG1,'2_個別入力シート（支援プログラム以外）'!$B$7:$GI$25,'2_個別入力シート（支援プログラム以外）'!CE6,0)& \"\"","v":""}]
[]
[]
[]
[]
["少子化対策全体の重要業績評価指標(KPI)及び定量的成果目標\n※全事業共通",null,null,null,null,null,null,"KPI項目",null,null,null,null,null,null,null,null,null,null,null,null,null,null,null,null,"単位",null,"目標値（時点）",null,null,null,null,"現状値（時点）"]
[null,null,null,null,null,null,null,{"$f":"VLOOKUP(AG1,'2_個別入力シート（支援プログラム以外）'!$B$7:$GI$25,'2_個別入力シート（支援プログラム以外）'!CF6,0)& \"\"","v":"荒尾・玉名地域結婚サポートセンター新規会員数"},null,null,null,null,null,null,null,null,null,null,null,null,null,null,null,null,{"$f":"VLOOKUP(AG1,'2_個別入力シート（支援プログラム以外）'!$B$7:$GI$25,'2_個別入力シート（支援プログラム以外）'!CG6,0)& \"\"","v":"人"},null,{"$f":"VLOOKUP(AG1,'2_個別入力シート（支援プログラム以外）'!$B$7:$GI$25,'2_個別入力シート（支援プログラム以外）'!CH6,0)& \"\"","v":"1\n（R7年度～R11年度）"},null,null,null,null,{"$f":"VLOOKUP(AG1,'2_個別入力シート（支援プログラム以外）'!$B$7:$GI$25,'2_個別入力シート（支援プログラム以外）'!CI6,0)& \"\"","v":"0\n（R6年度\n1月時点）"}]
[null,null,null,null,null,null,null,{"$f":"VLOOKUP(AG1,'2_個別入力シート（支援プログラム以外）'!$B$7:$GI$25,'2_個別入力シート（支援プログラム以外）'!CJ6,0)& \"\"","v":"不妊治療補助件数"},null,null,null,null,null,null,null,null,null,null,null,null,null,null,null,null,{"$f":"VLOOKUP(AG1,'2_個別入力シート（支援プログラム以外）'!$B$7:$GI$25,'2_個別入力シート（支援プログラム以外）'!CK6,0)& \"\"","v":"件"},null,{"$f":"VLOOKUP(AG1,'2_個別入力シート（支援プログラム以外）'!$B$7:$GI$25,'2_個別入力シート（支援プログラム以外）'!CL6,0)& \"\"","v":"5\n（R7年度～R11年度）"},null,null,null,null,{"$f":"VLOOKUP(AG1,'2_個別入力シート（支援プログラム以外）'!$B$7:$GI$25,'2_個別入力シート（支援プログラム以外）'!CM6,0)& \"\"","v":"3\n（R6.4～R7.2）"}]
[null,null,null,null,null,null,null,{"$f":"VLOOKUP(AG1,'2_個別入力シート（支援プログラム以外）'!$B$7:$GI$25,'2_個別入力シート（支援プログラム以外）'!CN6,0)& \"\"","v":"子育て関連講座参加者数"},null,null,null,null,null,null,null,null,null,null,null,null,null,null,null,null,{"$f":"VLOOKUP(AG1,'2_個別入力シート（支援プログラム以外）'!$B$7:$GI$25,'2_個別入力シート（支援プログラム以外）'!CO6,0)& \"\"","v":"人"},null,{"$f":"VLOOKUP(AG1,'2_個別入力シート（支援プログラム以外）'!$B$7:$GI$25,'2_個別入力シート（支援プログラム以外）'!CP6,0)& \"\"","v":"488\n（R7年度～R11年度）"},null,null,null,null,{"$f":"VLOOKUP(AG1,'2_個別入力シート（支援プログラム以外）'!$B$7:$GI$25,'2_個別入力シート（支援プログラム以外）'!CQ6,0)& \"\"","v":"487\n（R6.4～R7.1）"}]
[null,null,null,null,null,null,null,{"$f":"VLOOKUP(AG1,'2_個別入力シート（支援プログラム以外）'!$B$7:$GI$25,'2_個別入力シート（支援プログラム以外）'!CR6,0)& \"\"","v":"こども家庭センターにおける相談支援件数"},null,null,null,null,null,null,null,null,null,null,null,null,null,null,null,null,{"$f":"VLOOKUP(AG1,'2_個別入力シート（支援プログラム以外）'!$B$7:$GI$25,'2_個別入力シート（支援プログラム以外）'!CS6,0)& \"\"","v":"件"},null,{"$f":"VLOOKUP(AG1,'2_個別入力シート（支援プログラム以外）'!$B$7:$GI$25,'2_個別入力シート（支援プログラム以外）'!CT6,0)& \"\"","v":"60/年\n（R7年度～R11年度）"},null,null,null,null,{"$f":"VLOOKUP(AG1,'2_個別入力シート（支援プログラム以外）'!$B$7:$GI$25,'2_個別入力シート（支援プログラム以外）'!CU6,0)& \"\"","v":"47/年\n（R6.4～R7.1）"}]
[null,null,null,null,null,null,null,{"$f":"VLOOKUP(AG1,'2_個別入力シート（支援プログラム以外）'!$B$7:$GI$25,'2_個別入力シート（支援プログラム以外）'!CV6,0)& \"\"","v":""},null,null,null,null,null,null,null,null,null,null,null,null,null,null,null,null,{"$f":"VLOOKUP(AG1,'2_個別入力シート（支援プログラム以外）'!$B$7:$GI$25,'2_個別入力シート（支援プログラム以外）'!CW6,0)& \"\"","v":""},null,{"$f":"VLOOKUP(AG1,'2_個別入力シート（支援プログラム以外）'!$B$7:$GI$25,'2_個別入力シート（支援プログラム以外）'!CX6,0)& \"\"","v":""},null,null,null,null,{"$f":"VLOOKUP(AG1,'2_個別入力シート（支援プログラム以外）'!$B$7:$GI$25,'2_個別入力シート（支援プログラム以外）'!CY6,0)& \"\"","v":""}]
["参考指標\n※全事業共通",null,null,null,null,null,null,"項目",null,null,null,null,null,null,null,null,null,null,null,null,null,null,null,null,"単位",null,"直近の実績値（時点）"]
[null,null,null,null,null,null,null,"合計特殊出生率",null,null,null,null,null,null,null,null,null,null,null,null,null,null,null,null,null,null,{"$f":"VLOOKUP(AG1,'2_個別入力シート（支援プログラム以外）'!$B$7:$GI$25,'2_個別入力シート（支援プログラム以外）'!DB6,0)& \"\"","v":"2.44\n（R6年）"}]
[null,null,null,null,null,null,null,"婚姻件数",null,null,null,null,null,null,null,null,null,null,null,null,null,null,null,null,"件",null,{"$f":"VLOOKUP(AG1,'2_個別入力シート（支援プログラム以外）'!$B$7:$GI$25,'2_個別入力シート（支援プログラム以外）'!DE6,0)& \"\"","v":"22\n（R6年）"}]
[null,null,null,null,null,null,null,"婚姻率",null,null,null,null,null,null,null,null,null,null,null,null,null,null,null,null,null,null,{"$f":"VLOOKUP(AG1,'2_個別入力シート（支援プログラム以外）'!$B$7:$GI$25,'2_個別入力シート（支援プログラム以外）'!DH6,0)& \"\"","v":"4.27\n（R6年）"}]
["個別事業の重要業績評価指標(KPI)及び定量的成果目標",null,null,null,null,null,null,"KPI項目",null,null,null,null,null,null,null,null,null,null,null,null,null,null,null,null,"単位",null,"目標値（時点）",null,null,null,null,"現状値（時点）"]
[null,null,null,null,null,null,null,"番号",null,"項目"]
[null,null,null,null,null,null,null,null,null,"（アウトプット）"]
[null,null,null,null,null,null,null,"①",null,{"$f":"VLOOKUP(AG1,'2_個別入力シート（支援プログラム以外）'!$B$7:$GI$25,'2_個別入力シート（支援プログラム以外）'!DI6,0)& \"\"","v":""},null,null,null,null,null,null,null,null,null,null,null,null,null,null,{"$f":"VLOOKUP(AG1,'2_個別入力シート（支援プログラム以外）'!$B$7:$GI$25,'2_個別入力シート（支援プログラム以外）'!DJ6,0)& \"\"","v":""},null,{"$f":"VLOOKUP(AG1,'2_個別入力シート（支援プログラム以外）'!$B$7:$GI$25,'2_個別入力シート（支援プログラム以外）'!DK6,0)& \"\"","v":""},null,null,null,null,{"$f":"VLOOKUP(AG1,'2_個別入力シート（支援プログラム以外）'!$B$7:$GI$25,'2_個別入力シート（支援プログラム以外）'!DL6,0)& \"\"","v":""}]
[null,null,null,null,null,null,null,"②",null,{"$f":"VLOOKUP(AG1,'2_個別入力シート（支援プログラム以外）'!$B$7:$GI$25,'2_個別入力シート（支援プログラム以外）'!DM6,0)& \"\"","v":""},null,null,null,null,null,null,null,null,null,null,null,null,null,null,{"$f":"VLOOKUP(AG1,'2_個別入力シート（支援プログラム以外）'!$B$7:$GI$25,'2_個別入力シート（支援プログラム以外）'!DN6,0)& \"\"","v":""},null,{"$f":"VLOOKUP(AG1,'2_個別入力シート（支援プログラム以外）'!$B$7:$GI$25,'2_個別入力シート（支援プログラム以外）'!DO6,0)& \"\"","v":""},null,null,null,null,{"$f":"VLOOKUP(AG1,'2_個別入力シート（支援プログラム以外）'!$B$7:$GI$25,'2_個別入力シート（支援プログラム以外）'!DP6,0)& \"\"","v":""}]
[null,null,null,null,null,null,null,"③",null,{"$f":"VLOOKUP(AG1,'2_個別入力シート（支援プログラム以外）'!$B$7:$GI$25,'2_個別入力シート（支援プログラム以外）'!DQ6,0)& \"\"","v":""},null,null,null,null,null,null,null,null,null,null,null,null,null,null,{"$f":"VLOOKUP(AG1,'2_個別入力シート（支援プログラム以外）'!$B$7:$GI$25,'2_個別入力シート（支援プログラム以外）'!DR6,0)& \"\"","v":""},null,{"$f":"VLOOKUP(AG1,'2_個別入力シート（支援プログラム以外）'!$B$7:$GI$25,'2_個別入力シート（支援プログラム以外）'!DS6,0)& \"\"","v":""},null,null,null,null,{"$f":"VLOOKUP(AG1,'2_個別入力シート（支援プログラム以外）'!$B$7:$GI$25,'2_個別入力シート（支援プログラム以外）'!DT6,0)& \"\"","v":""}]
[null,null,null,null,null,null,null,"④",null,{"$f":"VLOOKUP(AG1,'2_個別入力シート（支援プログラム以外）'!$B$7:$GI$25,'2_個別入力シート（支援プログラム以外）'!DU6,0)& \"\"","v":""},null,null,null,null,null,null,null,null,null,null,null,null,null,null,{"$f":"VLOOKUP(AG1,'2_個別入力シート（支援プログラム以外）'!$B$7:$GI$25,'2_個別入力シート（支援プログラム以外）'!DV6,0)& \"\"","v":""},null,{"$f":"VLOOKUP(AG1,'2_個別入力シート（支援プログラム以外）'!$B$7:$GI$25,'2_個別入力シート（支援プログラム以外）'!DW6,0)& \"\"","v":""},null,null,null,null,{"$f":"VLOOKUP(AG1,'2_個別入力シート（支援プログラム以外）'!$B$7:$GI$25,'2_個別入力シート（支援プログラム以外）'!DX6,0)& \"\"","v":""}]
[null,null,null,null,null,null,null,"⑤",null,{"$f":"VLOOKUP(AG1,'2_個別入力シート（支援プログラム以外）'!$B$7:$GI$25,'2_個別入力シート（支援プログラム以外）'!DY6,0)& \"\"","v":""},null,null,null,null,null,null,null,null,null,null,null,null,null,null,{"$f":"VLOOKUP(AG1,'2_個別入力シート（支援プログラム以外）'!$B$7:$GI$25,'2_個別入力シート（支援プログラム以外）'!DZ6,0)& \"\"","v":""},null,{"$f":"VLOOKUP(AG1,'2_個別入力シート（支援プログラム以外）'!$B$7:$GI$25,'2_個別入力シート（支援プログラム以外）'!EA6,0)& \"\"","v":""},null,null,null,null,{"$f":"VLOOKUP(AG1,'2_個別入力シート（支援プログラム以外）'!$B$7:$GI$25,'2_個別入力シート（支援プログラム以外）'!EB6,0)& \"\"","v":""}]
[null,null,null,null,null,null,null,null,null,"（アウトカム) "]
[null,null,null,null,null,null,null,"①",null,"交付金事業に対する事業対象者（住民等）の満足度（該当事業に限る。）",null,null,null,null,null,null,null,null,null,null,null,null,null,null,"％",null,{"$f":"VLOOKUP(AG1,'2_個別入力シート（支援プログラム以外）'!$B$7:$GI$25,'2_個別入力シート（支援プログラム以外）'!EE6,0)& \"\"","v":""},null,null,null,null,{"$f":"VLOOKUP(AG1,'2_個別入力シート（支援プログラム以外）'!$B$7:$GI$25,'2_個別入力シート（支援プログラム以外）'!EF6,0)& \"\"","v":""}]
[null,null,null,null,null,null,null,"②",null,"希望どおりの結婚に向けて後押ししてくれたと感じた人の割合（該当事業に限る。）",null,null,null,null,null,null,null,null,null,null,null,null,null,null,"％",null,{"$f":"VLOOKUP(AG1,'2_個別入力シート（支援プログラム以外）'!$B$7:$GI$25,'2_個別入力シート（支援プログラム以外）'!EI6,0)& \"\"","v":""},null,null,null,null,{"$f":"VLOOKUP(AG1,'2_個別入力シート（支援プログラム以外）'!$B$7:$GI$25,'2_個別入力シート（支援プログラム以外）'!EJ6,0)& \"\"","v":""}]
[null,null,null,null,null,null,null,"③",null,"結婚、妊娠・出産、子育てに前向きになったと感じた人の割合（該当事業に限る。）",null,null,null,null,null,null,null,null,null,null,null,null,null,null,"％",null,{"$f":"VLOOKUP(AG1,'2_個別入力シート（支援プログラム以外）'!$B$7:$GI$25,'2_個別入力シート（支援プログラム以外）'!EM6,0)& \"\"","v":""},null,null,null,null,{"$f":"VLOOKUP(AG1,'2_個別入力シート（支援プログラム以外）'!$B$7:$GI$25,'2_個別入力シート（支援プログラム以外）'!EN6,0)& \"\"","v":""}]
[null,null,null,null,null,null,null,"④",null,{"$f":"VLOOKUP(AG1,'2_個別入力シート（支援プログラム以外）'!$B$7:$GI$25,'2_個別入力シート（支援プログラム以外）'!EO6,0)& \"\"","v":""},null,null,null,null,null,null,null,null,null,null,null,null,null,null,{"$f":"VLOOKUP(AG1,'2_個別入力シート（支援プログラム以外）'!$B$7:$GI$25,'2_個別入力シート（支援プログラム以外）'!EP6,0)& \"\"","v":""},null,{"$f":"VLOOKUP(AG1,'2_個別入力シート（支援プログラム以外）'!$B$7:$GI$25,'2_個別入力シート（支援プログラム以外）'!EQ6,0)& \"\"","v":""},null,null,null,null,{"$f":"VLOOKUP(AG1,'2_個別入力シート（支援プログラム以外）'!$B$7:$GI$25,'2_個別入力シート（支援プログラム以外）'!ER6,0)& \"\"","v":""}]
[null,null,null,null,null,null,null,"⑤",null,{"$f":"VLOOKUP(AG1,'2_個別入力シート（支援プログラム以外）'!$B$7:$GI$25,'2_個別入力シート（支援プログラム以外）'!ES6,0)& \"\"","v":""},null,null,null,null,null,null,null,null,null,null,null,null,null,null,{"$f":"VLOOKUP(AG1,'2_個別入力シート（支援プログラム以外）'!$B$7:$GI$25,'2_個別入力シート（支援プログラム以外）'!ET6,0)& \"\"","v":""},null,{"$f":"VLOOKUP(AG1,'2_個別入力シート（支援プログラム以外）'!$B$7:$GI$25,'2_個別入力シート（支援プログラム以外）'!EU6,0)& \"\"","v":""},null,null,null,null,{"$f":"VLOOKUP(AG1,'2_個別入力シート（支援プログラム以外）'!$B$7:$GI$25,'2_個別入力シート（支援プログラム以外）'!EV6,0)& \"\"","v":""}]
[null,null,null,null,null,null,null,"⑥",null,{"$f":"VLOOKUP(AG1,'2_個別入力シート（支援プログラム以外）'!$B$7:$GI$25,'2_個別入力シート（支援プログラム以外）'!EW6,0)& \"\"","v":""},null,null,null,null,null,null,null,null,null,null,null,null,null,null,{"$f":"VLOOKUP(AG1,'2_個別入力シート（支援プログラム以外）'!$B$7:$GI$25,'2_個別入力シート（支援プログラム以外）'!EX6,0)& \"\"","v":""},null,{"$f":"VLOOKUP(AG1,'2_個別入力シート（支援プログラム以外）'!$B$7:$GI$25,'2_個別入力シート（支援プログラム以外）'!EY6,0)& \"\"","v":""},null,null,null,null,{"$f":"VLOOKUP(AG1,'2_個別入力シート（支援プログラム以外）'!$B$7:$GI$25,'2_個別入力シート（支援プログラム以外）'!EZ6,0)& \"\"","v":""}]
[null,null,null,null,null,null,null,"⑦",null,{"$f":"VLOOKUP(AG1,'2_個別入力シート（支援プログラム以外）'!$B$7:$GI$25,'2_個別入力シート（支援プログラム以外）'!FA6,0)& \"\"","v":""},null,null,null,null,null,null,null,null,null,null,null,null,null,null,{"$f":"VLOOKUP(AG1,'2_個別入力シート（支援プログラム以外）'!$B$7:$GI$25,'2_個別入力シート（支援プログラム以外）'!FB6,0)& \"\"","v":""},null,{"$f":"VLOOKUP(AG1,'2_個別入力シート（支援プログラム以外）'!$B$7:$GI$25,'2_個別入力シート（支援プログラム以外）'!FC6,0)& \"\"","v":""},null,null,null,null,{"$f":"VLOOKUP(AG1,'2_個別入力シート（支援プログラム以外）'!$B$7:$GI$25,'2_個別入力シート（支援プログラム以外）'!FD6,0)& \"\"","v":""}]
[null,null,null,null,null,null,null,"⑧",null,{"$f":"VLOOKUP(AG1,'2_個別入力シート（支援プログラム以外）'!$B$7:$GI$25,'2_個別入力シート（支援プログラム以外）'!FE6,0)& \"\"","v":""},null,null,null,null,null,null,null,null,null,null,null,null,null,null,{"$f":"VLOOKUP(AG1,'2_個別入力シート（支援プログラム以外）'!$B$7:$GI$25,'2_個別入力シート（支援プログラム以外）'!FF6,0)& \"\"","v":""},null,{"$f":"VLOOKUP(AG1,'2_個別入力シート（支援プログラム以外）'!$B$7:$GI$25,'2_個別入力シート（支援プログラム以外）'!FG6,0)& \"\"","v":""},null,null,null,null,{"$f":"VLOOKUP(AG1,'2_個別入力シート（支援プログラム以外）'!$B$7:$GI$25,'2_個別入力シート（支援プログラム以外）'!FH6,0)& \"\"","v":""}]
["　　　　　　　　　　　　　　　　　　　　　　　　　　　　　　　　　　　　　　　　　　　　　　　"]

{"sheet":"個票（支援プログラム）","index":5,"n_rows":127,"n_cols":39,"rows_kept":127,"cut":false,"hidden":false,"merged":[[61,8,61,12],[61,13,61,16],[42,27,43,28],[111,0,126,6],[126,7,126,8],[126,9,126,23],[126,24,126,25],[126,26,126,30],[122,7,122,8],[122,9,122,23],[122,24,122,25],[122,26,122,30],[118,7,118,8],[118,9,118,23],[118,24,118,25],[118,26,118,30],[114,7,114,8],[114,9,114,23],[114,24,114,25],[114,26,114,30],[110,7,110,23],[110,24,110,25],[110,26,110,35],[111,7,111,23],[126,31,126,35],[124,7,124,8],[124,9,124,23],[124,24,124,25],[124,26,124,30],[124,31,124,35],[125,7,125,8],[125,9,125,23],[125,24,125,25],[125,26,125,30],[125,31,125,35],[18,38,19,38],[18,27,19,30],[18,31,19,35],[18,7,19,15],[18,16,19,21],[18,22,19,26],[22,0,30,6],[18,37,19,37],[18,0,19,6],[18,36,19,36],[20,0,21,6],[20,7,21,35],[20,36,21,36],[22,7,30,35],[16,36,17,36],[16,31,17,35],[42,5,43,9],[42,13,43,17],[42,21,43,25],[45,10,45,18],[50,10,50,17],[52,10,52,17],[47,10,47,22],[51,10,51,34],[40,2,40,35],[44,2,44,35],[45,2,46,4],[31,7,31,35],[16,0,17,6],[16,7,17,15],[16,16,17,17],[42,3,43,4],[42,29,43,33],[50,2,51,4],[50,5,50,9],[16,18,17,26],[16,27,17,30],[32,7,35,35],[122,31,122,35],[123,7,123,8],[123,9,123,23],[123,24,123,25],[123,26,123,30],[123,31,123,35],[120,7,120,8],[120,9,120,23],[120,24,120,25],[120,26,120,30],[120,31,120,35],[121,7,121,8],[121,9,121,23],[121,24,121,25],[121,26,121,30],[121,31,121,35],[118,31,118,35],[119,7,119,8],[119,9,119,23],[119,24,119,25],[119,26,119,30],[119,31,119,35],[116,7,116,8],[116,9,116,23],[116,24,116,25],[116,26,116,30],[116,31,116,35],[117,7,117,8],[117,9,117,23],[117,24,117,25],[117,26,117,30],[117,31,117,35],[114,31,114,35],[115,7,115,8],[115,9,115,23],[115,24,115,25],[115,26,115,30],[115,31,115,35],[112,24,112,25],[112,26,112,30],[112,31,112,35],[113,7,113,8],[113,9,113,23],[113,24,113,25],[113,26,113,30],[113,31,113,35],[111,24,111,25],[111,26,111,30],[111,31,111,35],[112,7,112,8],[112,9,112,23],[107,0,110,6],[107,7,107,23],[107,24,107,25],[107,26,107,35],[108,7,108,23],[108,24,108,25],[108,26,108,35],[109,7,109,23],[109,24,109,25],[109,26,109,35],[104,7,104,23],[104,24,104,25],[104,26,104,30],[104,31,104,35],[105,7,105,23],[105,24,105,25],[105,26,105,30],[105,31,105,35],[102,7,102,23],[102,24,102,25],[102,26,102,30],[102,31,102,35],[103,7,103,23],[103,24,103,25],[103,26,103,30],[103,31,103,35],[87,16,87,19],[88,12,88,13],[88,16,88,19],[97,2,97,35],[98,2,100,35],[101,0,106,6],[101,7,101,23],[101,24,101,25],[101,26,101,30],[101,31,101,35],[54,0,100,1],[106,7,106,23],[106,24,106,25],[106,26,106,30],[106,31,106,35],[85,6,85,7],[85,8,85,9],[85,11,85,13],[85,16,85,19],[86,6,86,7],[86,8,86,9],[86,11,86,13],[86,16,86,19],[85,21,96,35],[68,31,68,32],[68,33,68,34],[83,2,83,35],[63,2,63,35],[64,2,82,23],[64,24,64,35],[65,24,65,30],[65,31,65,32],[66,25,66,29],[66,30,66,31],[66,32,66,33],[66,34,66,35],[67,26,67,30],[68,26,68,30],[11,0,12,6],[11,7,12,35],[36,7,36,35],[37,7,39,35],[46,5,46,9],[41,2,41,35],[61,3,61,7],[67,31,67,32],[67,33,67,34],[61,19,61,23],[61,24,61,26],[48,10,48,34],[49,2,49,35],[51,5,51,9],[52,2,53,4],[52,5,52,9],[53,5,53,9],[53,10,53,34],[60,19,60,23],[60,24,60,32],[31,0,39,6],[40,0,53,1],[62,8,62,12],[62,13,62,16],[5,13,5,18],[5,19,5,34],[7,0,8,6],[7,7,8,35],[9,0,10,6],[9,7,10,35],[0,0,0,8],[0,32,0,34],[2,4,2,11],[2,12,2,26],[2,27,2,32],[4,13,4,18],[4,19,4,33],[59,2,59,35],[60,2,60,6],[60,7,60,15],[45,5,45,9],[46,10,46,34],[47,2,48,4],[47,5,47,9],[48,5,48,9],[13,0,15,6],[13,7,15,26],[13,27,15,30],[13,31,15,35],[54,2,54,35],[55,2,58,34],[42,11,43,12],[42,19,43,20]]}
["別紙様式第１　様式２",null,null,null,null,null,null,null,null,null,null,null,null,null,null,null,null,null,null,null,null,null,null,null,null,null,null,null,null,null,null,"個票","支援プ①",null,null,null,"データ整理用欄"]
[]
[null,null,null,null,{"$f":"IF(AK3=\"R8\",\"（令和８年度予算分）\",IF(AK3=\"R7\",\"（令和７年度予算分）\",\"\"))","v":"（令和７年度予算分）"},null,null,null,null,null,null,null,"地域少子化対策重点推進交付金　実施計画書",null,null,null,null,null,null,null,null,null,null,null,null,null,null,{"$f":"IF(AL3=\"都道府県\",\"（都道府県分）\",IF(AL3=\"政令指定都市\",\"（市町村分）\",IF(AL3=\"市町村\",\"（市町村分）\",\"\")))","v":"（市町村分）"},null,null,null,null,null,"個票",null,null,{"$f":"VLOOKUP(AG1,'3_個別入力シート（支援プログラム）'!$B$7:$CR$7,'3_個別入力シート（支援プログラム）'!I6,0)","v":"R7"},{"$f":"VLOOKUP(AG1,'3_個別入力シート（支援プログラム）'!$B$7:$CR$7,'3_個別入力シート（支援プログラム）'!D6,0)","v":"市町村"}]
[]
[null,null,null,null,null,null,null,null,null,null,null,null,null,"自治体名",null,null,null,null,null,{"$f":"VLOOKUP(AG1,'3_個別入力シート（支援プログラム）'!$B$7:$CR$7,'3_個別入力シート（支援プログラム）'!G6,0)& \"\"","v":"熊本県玉東町"}]
[null,null,null,null,null,null,null,null,null,null,null,null,null,"本事業の担当部局名",null,null,null,null,null,{"$f":"VLOOKUP(AG1,'3_個別入力シート（支援プログラム）'!$B$7:$CR$7,'3_個別入力シート（支援プログラム）'!H6,0)& \"\"","v":"企画財政課"}]
[]
["事業メニュー",null,null,null,null,null,null,"結婚・妊娠・共育ての相談機会提供・支援プログラム"]
[]
["区分",null,null,null,null,null,null,{"$f":"VLOOKUP(AG1,'3_個別入力シート（支援プログラム）'!$B$7:$CR$7,'3_個別入力シート（支援プログラム）'!K6,0)& \"\"","v":"一般コース"}]
[]
["関連事業メニュー",null,null,null,null,null,null,{"$f":"VLOOKUP(AG1,'3_個別入力シート（支援プログラム）'!$B$7:$CR$7,'3_個別入力シート（支援プログラム）'!L6,0)& \"\"","v":"4_1 結婚・妊娠・共育ての相談機会提供・支援プログラム（一般コース）"}]
[]
["個別事業名",null,null,null,null,null,null,{"$f":"VLOOKUP(AG1,'3_個別入力シート（支援プログラム）'!$B$7:$CR$7,'3_個別入力シート（支援プログラム）'!M6,0)& \"\"","v":"玉東町結婚新生活支援事業"},null,null,null,null,null,null,null,null,null,null,null,null,null,null,null,null,null,null,null,"新規／継続\n(一般財源での\n実施も含む)",null,null,null,{"$f":"VLOOKUP(AG1,'3_個別入力シート（支援プログラム）'!$B$7:$CR$7,'3_個別入力シート（支援プログラム）'!U6,0)& \"\"","v":"継続"}]
[]
[]
["実施期間",null,null,null,null,null,null,{"$f":"VLOOKUP(AG1,'3_個別入力シート（支援プログラム）'!$B$7:$CR$7,'3_個別入力シート（支援プログラム）'!S6,0)& \"\"","v":"令和8年4月1日"},null,null,null,null,null,null,null,null,"～",null,{"$f":"VLOOKUP(AG1,'3_個別入力シート（支援プログラム）'!$B$7:$CR$7,'3_個別入力シート（支援プログラム）'!T6,0)& \"\"","v":"令和9年3月31日"},null,null,null,null,null,null,null,null,"事業開始年度",null,null,null,{"$f":"DATEVALUE(AK17&\"年12月31日\")","v":42735},null,null,null,null,{"$f":"VLOOKUP(AG1,'3_個別入力シート（支援プログラム）'!$B$7:$CR$7,'3_個別入力シート（支援プログラム）'!V6,0)& \"\"","v":"2016"}]
[]
["総事業費（Ａ）（円）",null,null,null,null,null,null,{"$f":"AK19*1","v":2400000},null,null,null,null,null,null,null,null,"寄付金その他の収入予定額（Ｂ）（円）",null,null,null,null,null,{"$f":"AL19*1","v":0},null,null,null,null,"差引額（Ａ-Ｂ）（円）",null,null,null,{"$f":"AM19*1","v":2400000},null,null,null,null,{"$f":"VLOOKUP(AG1,'3_個別入力シート（支援プログラム）'!$B$7:$CR$7,'3_個別入力シート（支援プログラム）'!O6,0)","v":2400000},{"$f":"VLOOKUP(AG1,'3_個別入力シート（支援プログラム）'!$B$7:$CR$7,'3_個別入力シート（支援プログラム）'!P6,0)","v":0},{"$f":"VLOOKUP(AG1,'3_個別入力シート（支援プログラム）'!$B$7:$CR$7,'3_個別入力シート（支援プログラム）'!R6,0)","v":2400000}]
[]
["対象経費支出予定額（円）\n※補助率を乗じる前の額",null,null,null,null,null,null,{"$f":"AK21*1","v":2400000},null,null,null,null,null,null,null,null,null,null,null,null,null,null,null,null,null,null,null,null,null,null,null,null,null,null,null,null,{"$f":"VLOOKUP(AG1,'3_個別入力シート（支援プログラム）'!$B$7:$CR$7,'3_個別入力シート（支援プログラム）'!Q6,0)","v":2400000}]
[]
["費用内訳（円）",null,null,null,null,null,null,"個別事業の内容のとおり"]
[]
[]
[]
[]
[]
[]
[]
[]
["自治体における少子化対策の全体像及びその中での本個別事業の位置付け",null,null,null,null,null,null,"＜自治体における少子化対策の全体像＞※全事業共通\n\n\n\n\n"]
[null,null,null,null,null,null,null,{"$f":"VLOOKUP(AG1,'3_個別入力シート（支援プログラム）'!$B$7:$CR$7,'3_個別入力シート（支援プログラム）'!Y6,0) &\"\"","v":"　結婚・妊娠・共育ての相談機会提供・支援プログラムを実施し、結婚に伴う新生活を経済的に支援するため新生活費用に対して補助を行う。\n　また、荒尾・玉名地域結婚サポートセンター（有明広域行政事務組合）と連携して婚活事業を実施し、出会いの場の創出を重点的に行う。事業実施後には、対象者にアンケート調査等を行い、次年度以降により効果的な取組を行えるように留意する。"}]
[]
[]
[]
[null,null,null,null,null,null,null,"＜本個別事業の位置付け＞"]
[null,null,null,null,null,null,null,{"$f":"VLOOKUP(AG1,'3_個別入力シート（支援プログラム）'!$B$7:$CR$7,'3_個別入力シート（支援プログラム）'!Z6,0)& \"\"","v":"結婚・出産・子育ての希望をかなえ、安心して暮らすことが出来る魅力的な地域をつくる。"}]
[]
[]
["個別事業の内容",null,"１．概要"]
[null,null,"【対象費用】"]
[null,null,null,{"$f":"VLOOKUP(AG1,'3_個別入力シート（支援プログラム）'!$B$7:$CR$7,'3_個別入力シート（支援プログラム）'!AA6,0)& \"\"","v":"○"},null,"住宅取得費用",null,null,null,null,null,{"$f":"VLOOKUP(AG1,'3_個別入力シート（支援プログラム）'!$B$7:$CR$7,'3_個別入力シート（支援プログラム）'!AB6,0)& \"\"","v":"○"},null,"住宅リフォーム費用",null,null,null,null,null,{"$f":"VLOOKUP(AG1,'3_個別入力シート（支援プログラム）'!$B$7:$CR$7,'3_個別入力シート（支援プログラム）'!AC6,0)& \"\"","v":"○"},null,"住宅賃借費用",null,null,null,null,null,{"$f":"VLOOKUP(AG1,'3_個別入力シート（支援プログラム）'!$B$7:$CR$7,'3_個別入力シート（支援プログラム）'!AD6,0)& \"\"","v":"○"},null,"引越費用"]
[]
[null,null,"【補助対象要件】　原則として国基準とし、自治体独自基準による場合は当該欄に記載"]
[null,null,"所得要件",null,null,"国基準",null,null,null,null,"夫婦の合計所得が500万円未満"]
[null,null,null,null,null,"自治体独自基準",null,null,null,null,{"$f":"VLOOKUP(AG1,'3_個別入力シート（支援プログラム）'!$B$7:$CR$7,'3_個別入力シート（支援プログラム）'!AE6,0)& \"\"","v":""}]
[null,null,"年齢要件",null,null,"国基準",null,null,null,null,"夫婦ともに婚姻日における年齢が39歳以下の世帯"]
[null,null,null,null,null,"自治体独自基準",null,null,null,null,{"$f":"VLOOKUP(AG1,'3_個別入力シート（支援プログラム）'!$B$7:$CR$7,'3_個別入力シート（支援プログラム）'!AF6,0)& \"\"","v":""}]
[null,null,"【補助上限額】　原則として国基準とし、自治体独自基準による場合は当該欄に記載"]
[null,null,"29歳以下\nの場合",null,null,"国基準",null,null,null,null,"各費用に係る合計が60万円"]
[null,null,null,null,null,"自治体独自基準",null,null,null,null,{"$f":"VLOOKUP(AG1,'3_個別入力シート（支援プログラム）'!$B$7:$CR$7,'3_個別入力シート（支援プログラム）'!AG6,0)& \"\"","v":""}]
[null,null,"39歳以下\nの場合",null,null,"国基準",null,null,null,null,"各費用に係る合計が30万円"]
[null,null,null,null,null,"自治体独自基準",null,null,null,null,{"$f":"VLOOKUP(AG1,'3_個別入力シート（支援プログラム）'!$B$7:$CR$7,'3_個別入力シート（支援プログラム）'!AH6,0)& \"\"","v":""}]
[null,null,"【その他独自要件】　"]
[null,null,{"$f":"VLOOKUP(AG1,'3_個別入力シート（支援プログラム）'!$B$7:$CR$7,'3_個別入力シート（支援プログラム）'!AI6,0)& \"\"","v":""}]
[]
[]
[]
[null,null,"２．申請見込"]
[null,null,"①新規世帯見込",null,null,null,null,{"$f":"VLOOKUP(AG1,'3_個別入力シート（支援プログラム）'!$B$7:$CR$7,'3_個別入力シート（支援プログラム）'!AP6,0)& \"\"","v":"4"},null,null,null,null,null,null,null,null,"世帯",null,null,"②継続補助世帯見込",null,null,null,null,{"$f":"VLOOKUP(AG1,'3_個別入力シート（支援プログラム）'!$B$7:$CR$7,'3_個別入力シート（支援プログラム）'!AQ6,0)","v":2},null,null,null,null,null,null,null,null,"世帯"]
[null,null,null,"上記のうち",null,null,null,null,"ともに29歳以下",null,null,null,null,{"$f":"VLOOKUP(AG1,'3_個別入力シート（支援プログラム）'!$B$7:$CR$7,'3_個別入力シート（支援プログラム）'!AN6,0)","v":2},null,null,null,"世帯",null,"（継続補助規定の有無）",null,null,null,null,{"$f":"VLOOKUP(AG1,'3_個別入力シート（支援プログラム）'!$B$7:$CR$7,'3_個別入力シート（支援プログラム）'!AR6,0)& \"\"","v":"有"}]
[null,null,null,null,null,null,null,null,"その他",null,null,null,null,{"$f":"VLOOKUP(AG1,'3_個別入力シート（支援プログラム）'!$B$7:$CR$7,'3_個別入力シート（支援プログラム）'!AO6,0)","v":2},null,null,null,"世帯"]
[null,null,"【世帯数積算根拠】"]
[null,null,{"$f":"VLOOKUP(AG1,'3_個別入力シート（支援プログラム）'!$B$7:$CR$7,'3_個別入力シート（支援プログラム）'!AS6,0)& \"\"","v":"・申請見込については、令和5年度及び令和6年度の当事業における支給実績から4世帯とした。（R5年度：4件、R6年度5件）"},null,null,null,null,null,null,null,null,null,null,null,null,null,null,null,null,null,null,null,null,null,"　(参考）"]
[null,null,null,null,null,null,null,null,null,null,null,null,null,null,null,null,null,null,null,null,null,null,null,null,"　【令和７年度申請状況】",null,null,null,null,null,null,{"$f":"VLOOKUP(AG1,'3_個別入力シート（支援プログラム）'!$B$7:$CR$7,'3_個別入力シート（支援プログラム）'!AJ6,0)& \"\"","v":"実施中"}]
[null,null,null,null,null,null,null,null,null,null,null,null,null,null,null,null,null,null,null,null,null,null,null,null,null,"　申請世帯数見込",null,null,null,null,{"$f":"VLOOKUP(AG1,'3_個別入力シート（支援プログラム）'!$B$7:$CR$7,'3_個別入力シート（支援プログラム）'!AM6,0)& \"\"","v":"2"},null,"世帯"]
[null,null,null,null,null,null,null,null,null,null,null,null,null,null,null,null,null,null,null,null,null,null,null,null,null,null,"～12月(実績)",null,null,null,null,{"$f":"VLOOKUP(AG1,'3_個別入力シート（支援プログラム）'!$B$7:$CR$7,'3_個別入力シート（支援プログラム）'!AK6,0)","v":1},null,"世帯"]
[null,null,null,null,null,null,null,null,null,null,null,null,null,null,null,null,null,null,null,null,null,null,null,null,null,null,"1月～3月(見込)",null,null,null,null,{"$f":"VLOOKUP(AG1,'3_個別入力シート（支援プログラム）'!$B$7:$CR$7,'3_個別入力シート（支援プログラム）'!AL6,0)","v":1},null,"世帯"]
[]
[]
[]
[]
[]
[]
[]
[]
[]
[]
[]
[]
[]
[]
[null,null,"【金額積算根拠】"]
[null,null,"＜上限額＞",null,null,null,null,null,null,null,null,null,null,null,null,null,null,null,null,null,null,"＜左記の上限額の合計を使用しない場合の積算＞"]
[null,null,"　（29歳以下）",null,null,null,{"$f":"N62","v":2},null,"世帯",null,"×",600000,null,null,"円","=",{"$f":"G86*L86","v":1200000},null,null,null,"円",{"$f":"VLOOKUP(AG1,'3_個別入力シート（支援プログラム）'!$B$7:$CR$7,'3_個別入力シート（支援プログラム）'!AX6,0)& \"\"","v":""}]
[null,null,"　（その他）",null,null,null,{"$f":"N63","v":2},null,"世帯",null,"×",300000,null,null,"円","=",{"$f":"G87*L87","v":600000},null,null,null,"円"]
[null,null,null,null,null,null,null,null,null,null,null,"　（継続補助）",null,null,null,null,{"$f":"AK88*1","v":600000},null,null,null,"円",null,null,null,null,null,null,null,null,null,null,null,null,null,null,null,{"$f":"VLOOKUP(AG1,'3_個別入力シート（支援プログラム）'!$B$7:$CR$7,'3_個別入力シート（支援プログラム）'!AV6,0)","v":600000}]
[null,null,null,null,null,null,null,null,null,null,null,null,"合計",null,null,null,{"$f":"SUM(Q86:T88)","v":2400000},null,null,null,"円"]
[]
[]
[]
[]
[]
[]
[]
[]
[null,null,"３．広報の実施予定"]
[null,null,{"$f":"VLOOKUP(AG1,'3_個別入力シート（支援プログラム）'!$B$7:$CR$7,'3_個別入力シート（支援プログラム）'!AY6,0)& \"\"","v":"・町ホームページおよび広報紙、公式ＬＩＮＥを活用し積極的に周知するほか、窓口において婚姻者に周知を図る。"}]
[]
[]
["少子化対策全体の重要業績評価指標(KPI)及び定量的成果目標\n※全事業共通",null,null,null,null,null,null,"KPI項目",null,null,null,null,null,null,null,null,null,null,null,null,null,null,null,null,"単位",null,"目標値（時点）",null,null,null,null,"現状値（時点）"]
[null,null,null,null,null,null,null,{"$f":"VLOOKUP(AG1,'3_個別入力シート（支援プログラム）'!$B$7:$CR$7,'3_個別入力シート（支援プログラム）'!AZ6,0)& \"\"","v":"荒尾・玉名地域結婚サポートセンター新規会員数"},null,null,null,null,null,null,null,null,null,null,null,null,null,null,null,null,{"$f":"VLOOKUP(AG1,'3_個別入力シート（支援プログラム）'!$B$7:$CR$7,'3_個別入力シート（支援プログラム）'!BA6,0)& \"\"","v":"人"},null,{"$f":"VLOOKUP(AG1,'3_個別入力シート（支援プログラム）'!$B$7:$CR$7,'3_個別入力シート（支援プログラム）'!BB6,0)& \"\"","v":"1\n（R7年度～R11年度）"},null,null,null,null,{"$f":"VLOOKUP(AG1,'3_個別入力シート（支援プログラム）'!$B$7:$CR$7,'3_個別入力シート（支援プログラム）'!BC6,0)& \"\"","v":"0\n（R6年度\n1月時点）"}]
[null,null,null,null,null,null,null,{"$f":"VLOOKUP(AG1,'3_個別入力シート（支援プログラム）'!$B$7:$CR$7,'3_個別入力シート（支援プログラム）'!BD6,0)& \"\"","v":"不妊治療補助件数"},null,null,null,null,null,null,null,null,null,null,null,null,null,null,null,null,{"$f":"VLOOKUP(AG1,'3_個別入力シート（支援プログラム）'!$B$7:$CR$7,'3_個別入力シート（支援プログラム）'!BE6,0)& \"\"","v":"件"},null,{"$f":"VLOOKUP(AG1,'3_個別入力シート（支援プログラム）'!$B$7:$CR$7,'3_個別入力シート（支援プログラム）'!BF6,0)& \"\"","v":"5\n（R7年度～R11年度）"},null,null,null,null,{"$f":"VLOOKUP(AG1,'3_個別入力シート（支援プログラム）'!$B$7:$CR$7,'3_個別入力シート（支援プログラム）'!BG6,0)& \"\"","v":"3\n（R6.4～R7.2）"}]
[null,null,null,null,null,null,null,{"$f":"VLOOKUP(AG1,'3_個別入力シート（支援プログラム）'!$B$7:$CR$7,'3_個別入力シート（支援プログラム）'!BH6,0)& \"\"","v":"子育て関連講座参加者数"},null,null,null,null,null,null,null,null,null,null,null,null,null,null,null,null,{"$f":"VLOOKUP(AG1,'3_個別入力シート（支援プログラム）'!$B$7:$CR$7,'3_個別入力シート（支援プログラム）'!BI6,0)& \"\"","v":"人"},null,{"$f":"VLOOKUP(AG1,'3_個別入力シート（支援プログラム）'!$B$7:$CR$7,'3_個別入力シート（支援プログラム）'!BJ6,0)& \"\"","v":"488\n（R7年度～R11年度）"},null,null,null,null,{"$f":"VLOOKUP(AG1,'3_個別入力シート（支援プログラム）'!$B$7:$CR$7,'3_個別入力シート（支援プログラム）'!BK6,0)& \"\"","v":"487\n（R6.4～R7.1）"}]
[null,null,null,null,null,null,null,{"$f":"VLOOKUP(AG1,'3_個別入力シート（支援プログラム）'!$B$7:$CR$7,'3_個別入力シート（支援プログラム）'!BL6,0)& \"\"","v":"こども家庭センターにおける相談支援件数"},null,null,null,null,null,null,null,null,null,null,null,null,null,null,null,null,{"$f":"VLOOKUP(AG1,'3_個別入力シート（支援プログラム）'!$B$7:$CR$7,'3_個別入力シート（支援プログラム）'!BM6,0)& \"\"","v":"件"},null,{"$f":"VLOOKUP(AG1,'3_個別入力シート（支援プログラム）'!$B$7:$CR$7,'3_個別入力シート（支援プログラム）'!BN6,0)& \"\"","v":"60/年\n（R7年度～R11年度）"},null,null,null,null,{"$f":"VLOOKUP(AG1,'3_個別入力シート（支援プログラム）'!$B$7:$CR$7,'3_個別入力シート（支援プログラム）'!BO6,0)& \"\"","v":"47/年\n（R6.4～R7.1）"}]
[null,null,null,null,null,null,null,{"$f":"VLOOKUP(AG1,'3_個別入力シート（支援プログラム）'!$B$7:$CR$7,'3_個別入力シート（支援プログラム）'!BP6,0)& \"\"","v":""},null,null,null,null,null,null,null,null,null,null,null,null,null,null,null,null,{"$f":"VLOOKUP(AG1,'3_個別入力シート（支援プログラム）'!$B$7:$CR$7,'3_個別入力シート（支援プログラム）'!BQ6,0)& \"\"","v":""},null,{"$f":"VLOOKUP(AG1,'3_個別入力シート（支援プログラム）'!$B$7:$CR$7,'3_個別入力シート（支援プログラム）'!BR6,0)& \"\"","v":""},null,null,null,null,{"$f":"VLOOKUP(AG1,'3_個別入力シート（支援プログラム）'!$B$7:$CR$7,'3_個別入力シート（支援プログラム）'!BS6,0)& \"\"","v":""}]
["参考指標\n※全事業共通",null,null,null,null,null,null,"項目",null,null,null,null,null,null,null,null,null,null,null,null,null,null,null,null,"単位",null,"直近の実績値（時点）"]
[null,null,null,null,null,null,null,"合計特殊出生率",null,null,null,null,null,null,null,null,null,null,null,null,null,null,null,null,null,null,{"$f":"VLOOKUP(AG1,'3_個別入力シート（支援プログラム）'!$B$7:$CR$7,'3_個別入力シート（支援プログラム）'!BV6,0)& \"\"","v":"2.44\n（R6年）"}]
[null,null,null,null,null,null,null,"婚姻件数",null,null,null,null,null,null,null,null,null,null,null,null,null,null,null,null,"件",null,{"$f":"VLOOKUP(AG1,'3_個別入力シート（支援プログラム）'!$B$7:$CR$7,'3_個別入力シート（支援プログラム）'!BY6,0)& \"\"","v":"22\n（R6年）"}]
[null,null,null,null,null,null,null,"婚姻率",null,null,null,null,null,null,null,null,null,null,null,null,null,null,null,null,null,null,{"$f":"VLOOKUP(AG1,'3_個別入力シート（支援プログラム）'!$B$7:$CR$7,'3_個別入力シート（支援プログラム）'!CB6,0)& \"\"","v":"4.27\n（R6年）"}]
["個別事業の重要業績評価指標(KPI)及び定量的成果目標",null,null,null,null,null,null,"KPI項目",null,null,null,null,null,null,null,null,null,null,null,null,null,null,null,null,"単位",null,"目標値（時点）",null,null,null,null,"現状値（時点）"]
[null,null,null,null,null,null,null,"番号",null,"項目"]
[null,null,null,null,null,null,null,null,null,"（アウトプット）"]
[null,null,null,null,null,null,null,"①",null,"支給世帯実績／支給見込世帯数の割合",null,null,null,null,null,null,null,null,null,null,null,null,null,null,"％",null,{"$f":"VLOOKUP(AG1,'3_個別入力シート（支援プログラム）'!$B$7:$CR$7,'3_個別入力シート（支援プログラム）'!CE6,0)& \"\"","v":"100（R8年度）"},null,null,null,null,{"$f":"VLOOKUP(AG1,'3_個別入力シート（支援プログラム）'!$B$7:$CR$7,'3_個別入力シート（支援プログラム）'!CF6,0)& \"\"","v":"33.3（R7年度見込）"}]
[]
[]
[]
[]
[]
[]
[]
[]
[]
[null,null,null,null,null,null,null,null,null,"（アウトカム)"]
[null,null,null,null,null,null,null,"①",null,"結婚・妊娠・共育ての相談機会提供・支援プログラムに関するアンケートにおける「本事業の認知度」",null,null,null,null,null,null,null,null,null,null,null,null,null,null,"％",null,{"$f":"VLOOKUP(AG1,'3_個別入力シート（支援プログラム）'!$B$7:$CR$7,'3_個別入力シート（支援プログラム）'!CI6,0)& \"\"","v":"80（R8年度）"},null,null,null,null,{"$f":"VLOOKUP(AG1,'3_個別入力シート（支援プログラム）'!$B$7:$CR$7,'3_個別入力シート（支援プログラム）'!CJ6,0)& \"\"","v":"80（R6年度実績）"}]
[null,null,null,null,null,null,null,"②",null,"結婚・妊娠・共育ての相談機会提供・支援プログラムに関するアンケートにおける「地域に応援されていると感じた世帯の割合」",null,null,null,null,null,null,null,null,null,null,null,null,null,null,"％",null,{"$f":"VLOOKUP(AG1,'3_個別入力シート（支援プログラム）'!$B$7:$CR$7,'3_個別入力シート（支援プログラム）'!CM6,0)& \"\"","v":"80（R8年度）"},null,null,null,null,{"$f":"VLOOKUP(AG1,'3_個別入力シート（支援プログラム）'!$B$7:$CR$7,'3_個別入力シート（支援プログラム）'!CN6,0)& \"\"","v":"80（R6年度実績）"}]

{"sheet":"リンク先","index":6,"n_rows":157,"n_cols":13,"rows_kept":157,"cut":false,"hidden":true,"merged":[[95,0,95,5],[145,2,145,4],[0,6,0,8]]}
[null,null,null,null,null,null,"補助率(令和8年度)",null,null,"補助率(令和7年度)"]
["様式１－１","タイトル","地域少子化対策重点推進交付金",null,null,"事業メニュー","財政力指数 1.0以上 (1)","通常 (2)","財政力指数 0.3以下 (3)","共通 (4)"]
["様式１－１","基準額R7","都道府県",210000000,null,"ライフデザイン・結婚支援重点推進事業一般メニュー",0.5,0.66666666666666663,0.75,0.66666666666666663]
[null,null,"政令指定都市",105000000,null,"ライフデザイン・結婚支援重点推進事業重点メニュー",0.5,0.75,0.75,0.75]
[null,null,"市町村",70000000,null,"結婚支援コンシェルジュ事業結婚支援コンシェルジュ事業",0.5,0.75,0.75,0.75]
[null,"基準額R8",{"$f":"C3","v":"都道府県"},30000000,null,"結婚_妊娠・出産_子育てに温かい社会づくり・気運醸成事業一般メニュー",0.5,0.5,0.66666666666666696,0.5]
[null,null,"政令指定都市",15000000,null,"結婚_妊娠・出産_子育てに温かい社会づくり・気運醸成事業重点メニュー",0.5,0.66666666666666663,0.75,0.66666666666666663]
[null,null,"市町村",10000000,null,"結婚・妊娠・共育ての相談機会提供・支援プログラム一般コース",0.5,0.5,0.5,0.5]
["様式１－２","自治体区分",{"$f":"C3","v":"都道府県"},null,null,"結婚・妊娠・共育ての相談機会提供・支援プログラム都道府県主導型市町村連携コース",0.5,0.66666666666666663,0.66666666666666663,0.66666666666666663]
[null,null,"政令指定都市"]
[null,null,"市町村"]
[null,"年度","R7"]
[null,null,"R8"]
[]
["様式１－２","事業メニュー"]
[null,"R7","ライフデザイン・結婚支援重点推進事業"]
[null,null,"結婚支援コンシェルジュ事業",null,null," "]
[null,null,"結婚_妊娠・出産_子育てに温かい社会づくり・気運醸成事業"]
[null,null,"結婚・妊娠・共育ての相談機会提供・支援プログラム"]
[null,"R8",{"$f":"C16","v":"ライフデザイン・結婚支援重点推進事業"}]
[null,null,"結婚支援コンシェルジュ事業"]
[null,null,"結婚_妊娠・出産_子育てに温かい社会づくり・気運醸成事業"]
[null,null,"結婚・妊娠・共育ての相談機会提供・支援プログラム"]
["様式１－２","区分"]
[null,"R7","ライフデザイン・結婚支援重点推進事業","一般メニュー"]
[null,null,null,"重点メニュー"]
[null,null,"結婚支援コンシェルジュ事業","結婚支援コンシェルジュ事業"]
[null,null,"結婚_妊娠・出産_子育てに温かい社会づくり・気運醸成事業","一般メニュー"]
[null,null,null,"重点メニュー"]
[null,null,"結婚・妊娠・共育ての相談機会提供・支援プログラム","一般コース"]
[null,null,null,"都道府県主導型市町村連携コース"]
[null,"R8","ライフデザイン・結婚支援重点推進事業","一般メニュー"]
[null,null,null,"重点メニュー"]
[null,null,"結婚支援コンシェルジュ事業","結婚支援コンシェルジュ事業"]
[null,null,"結婚_妊娠・出産_子育てに温かい社会づくり・気運醸成事業","一般メニュー"]
[null,null,null,"重点メニュー"]
[null,null,"結婚・妊娠・共育ての相談機会提供・支援プログラム","一般コース"]
[null,null,null,"都道府県主導型市町村連携コース"]
["様式１－２","関連事業メニュー"]
[null,"R7","ライフデザイン・結婚支援重点推進事業","一般メニュー","1_1_1 結婚支援センターに関する取組"]
[null,null,null,null,"1_1_2 結婚支援ボランティア等に関する取組"]
[null,null,null,null,"1_1_3 出会いの機会・場の提供に関する取組"]
[null,null,null,null,"1_1_4 結婚支援事業者との官民連携型結婚支援"]
[null,null,null,null,"1_1_5 AIを始めとするマッチングシステムの高度化・地域連携"]
[null,null,null,null,"1_1_6 その他、ライフデザイン・結婚支援重点推進事業"]
[null,null,null,"重点メニュー","1_2_1 自治体間連携を伴うライフデザイン・結婚支援重点推進"]
[null,null,null,null,"1_2_2 若い世代の描くライフデザイン支援"]
[null,null,null,null,"1_2_3 地域の結婚支援ボランティア・事業者等を活用した伴走型結婚支援の充実"]
[]
[]
[null,null,"結婚支援コンシェルジュ事業","結婚支援コンシェルジュ事業","2_1 結婚支援コンシェルジュ事業"]
[null,null,"結婚_妊娠・出産_子育てに温かい社会づくり・気運醸成事業","一般メニュー","3_1_1 その他、結婚、妊娠・出産、子育てに温かい社会づくり・気運醸成事業"]
[null,null,null,null,"3_1_2 ICT活用、官民連携等による結婚支援等の更なる推進のための調査研究"]
[null,null,null,null,"3_1_3 企業等が地域等のために結婚を希望する者の新たなマッチングの可能性を創出する取組"]
[]
[]
[]
[]
[null,null,null,"重点メニュー","3_2_1 自治体間連携を伴う結婚、妊娠・出産、子育てに温かい社会づくり・気運醸成"]
[null,null,null,null,"3_2_2 地域全体で結婚・子育て、子育てと仕事の両立と多様な働き方を応援する気運醸成"]
[null,null,null,null,"3_2_3 育児休業取得と家事・育児分担の促進"]
[]
[]
[]
[null,null,"結婚・妊娠・共育ての相談機会提供・支援プログラム","一般コース","4_1 結婚・妊娠・共育ての相談機会提供・支援プログラム（一般コース）"]
[null,null,null,"都道府県主導型市町村連携コース","4_2 結婚・妊娠・共育ての相談機会提供・支援プログラム（都道府県主導型市町村連携コース）"]
[null,"R8","ライフデザイン・結婚支援重点推進事業","一般メニュー",{"$f":"E40 &\"\"","v":"1_1_1 結婚支援センターに関する取組"}]
[null,null,null,null,{"$f":"E41 &\"\"","v":"1_1_2 結婚支援ボランティア等に関する取組"}]
[null,null,null,null,"1_1_3 出会いの機会・場の提供に関する取組"]
[null,null,null,null,"1_1_4 結婚支援事業者との官民連携型結婚支援"]
[null,null,null,null,"1_1_5 AIを始めとするマッチングシステムの高度化・地域連携"]
[null,null,null,null,"1_1_6 その他、ライフデザイン・結婚支援重点推進事業"]
[null,null,null,"重点メニュー","1_2_1 自治体間連携を伴うライフデザイン・結婚支援重点推進"]
[null,null,null,null,"1_2_2 若い世代の描くライフデザイン支援"]
[null,null,null,null,"1_2_3 地域の結婚支援ボランティア・事業者等を活用した伴走型結婚支援の充実"]
[null,null,null,null,""]
[null,null,null,null,""]
[null,null,"結婚支援コンシェルジュ事業","結婚支援コンシェルジュ事業","2_1 結婚支援コンシェルジュ事業"]
[null,null,"結婚_妊娠・出産_子育てに温かい社会づくり・気運醸成事業","一般メニュー","3_1_1 その他、結婚、妊娠・出産、子育てに温かい社会づくり・気運醸成事業"]
[null,null,null,null,"3_1_2 ICT活用、官民連携等による結婚支援等の更なる推進のための調査研究"]
[null,null,null,null,"3_1_3 企業等が地域等のために結婚を希望する者の新たなマッチングの可能性を創出する取組"]
[null,null,null,null,""]
[null,null,null,null,""]
[null,null,null,null,""]
[null,null,null,null,""]
[null,null,null,"重点メニュー","3_2_1 自治体間連携を伴う結婚、妊娠・出産、子育てに温かい社会づくり・気運醸成"]
[null,null,null,null,"3_2_2 地域全体で結婚・子育て、子育てと仕事の両立と多様な働き方を応援する気運醸成"]
[null,null,null,null,"3_2_3 育児休業取得と家事・育児分担の促進"]
[null,null,null,null,""]
[null,null,null,null,""]
[null,null,null,null,""]
[null,null,"結婚・妊娠・共育ての相談機会提供・支援プログラム","一般コース","4_1 結婚・妊娠・共育ての相談機会提供・支援プログラム（一般コース）"]
[null,null,null,"都道府県主導型市町村連携コース","4_2 結婚・妊娠・共育ての相談機会提供・支援プログラム（都道府県主導型市町村連携コース）"]
[null,null,null,null,null,null,null,null,null,null,null,"確認\nチェック欄"]
[]
["単位など",null,null,null,null,null,null,"（要件充足-共通-）プルダウン"]
["都道府県","北海道","R8","①","％","諸謝金",null,"(共通要件_各種経費)"]
["政令指定都市","青森県","R7","②","人","賃金",null,"含まれている"]
["市町村","岩手県",null,"③","件","報償費",null,"含まれていない"]
[null,"宮城県",null,"④","回","旅費"]
["（都道府県分）※不使用","秋田県",null,"⑤","団体","需用費",null,"(共通要件_個人給付②)"]
["（市町村分）※不使用","山形県",null,"⑥","割","役務費",null,"含まれている（留意点等の要件ア〜エを満たしている）"]
[null,"福島県",null,"⑦","社","委託料",null,"含まれている（留意点等の要件ア〜エを満たしていない）"]
[null,"茨城県",null,"⑧","組","使用料及び賃借料",null,"含まれていない"]
[null,"栃木県",null,"⑨","店舗","備品購入費"]
[null,"群馬県",null,"⑩","校","負担金"]
[null,"埼玉県",null,"⑪","部","補助金"]
[null,"千葉県",null,"⑫","枚"]
[null,"東京都",null,"⑬","市区町村","寄付金"]
[null,"神奈川県",null,"⑭","市町村","その他の収入"]
[null,"新潟県",null,"⑮","市町"]
[null,"富山県",null,"⑯","か所"]
[null,"石川県",null,"⑰","世帯","【事業流用の有無】"]
[null,"福井県",null,"⑱",null,"有"]
[null,"山梨県",null,"⑲",null,"無"]
[null,"長野県"]
[null,"岐阜県"]
[null,"静岡県"]
[null,"愛知県"]
[null,"三重県"]
[null,"滋賀県"]
[null,"京都府"]
[null,"大阪府"]
[null,"兵庫県"]
[null,"奈良県"]
[null,"和歌山県"]
[null,"鳥取県"]
[null,"島根県"]
[null,"岡山県"]
[null,"広島県"]
[null,"山口県"]
[null,"徳島県"]
[null,"香川県"]
[null,"愛媛県"]
[null,"高知県"]
[null,"福岡県"]
[null,"佐賀県"]
[null,"長崎県"]
[null,"熊本県"]
[null,"大分県"]
[null,"宮崎県"]
[null,"鹿児島県"]
[null,"沖縄県"]
[]
[null,null,null,null,null,"要件１","要件２","要件３","要件４","要件５","要件６","要件７","要件８"]
[null,null,"共通要件",null,null,"＜人件費＞\n職員の人件費（次に掲げるものを除く。）が含まれていないか。\n・事業に伴う会計年度任用職員のもの\n・結婚支援センターのもの\n\n【リスト選択】","＜備品購入＞\n備品購入に要する経費が含まれていないか。\n\n【リスト選択】","＜施設整備＞\n施設整備に要する経費が含まれていないか。\n\n【リスト選択】","＜個人給付①＞\n個人への金銭給付などによる個人の負担を直接的に軽減する事業に要する経費（次に掲げるものを除く。）が含まれていないか。\n・結婚支援センター及び結婚支援事業者の登録優待費用\n\n【リスト選択】","＜個人給付②＞\n結婚支援センター及び結婚支援事業者の登録優待費用が含まれていないか。\n\n【リスト選択】","＜他の国庫負担金等＞\n他の国庫負担金、補助金又は交付金の交付の対象となる事業に要する経費が含まれていないか。\n\n【リスト選択】"]
[null,null,"ライフデザイン・結婚支援重点推進事業","重点メニュー","1_2_1 自治体間連携を伴うライフデザイン・結婚支援重点推進","実施要領別記１第２の１（２）アに規定する事業内容となっているか。","複数の自治体により構成されるライフデザイン・結婚支援その他の少子化対策に関して地域が抱える課題を解決する場（協議会等）を設けているか。","協議会等を構成する自治体による「実質的な協働」(費用、役務の分担)が認められるものであるか。"]
[null,null,null,null,"1_2_2 若い世代の描くライフデザイン支援","実施要領別記１第２の１（２）イに規定する事業内容となっているか。"]
[null,null,null,null,"1_2_3 結婚支援事業者との官民連携型結婚支援","実施要領別記１第２の１（２）ウに規定する事業内容となっているか。","連携する結婚支援事業者について、利用者の安全が十分に確保されていることを確認しているか。"]
[null,null,null,null,"1_2_4 AIを始めとするマッチングシステムの高度化・地域連携","実施要領別記１第２の１（２）エに規定する事業内容となっているか。"]
[null,null,null,null,"1_2_5 地域の結婚支援ボランティア・事業者等を活用した伴走型結婚支援の充実","実施要領別記１第２の１（２）オに規定する事業内容となっているか。"]
[null,null,"結婚支援コンシェルジュ事業","結婚支援コンシェルジュ事業","2_1 結婚支援コンシェルジュ事業","実施要領別記１第２の２に規定する事業内容となっているか。"]
[null,null,"結婚_妊娠・出産_子育てに温かい社会づくり・気運醸成事業","重点メニュー","3_2_1 自治体間連携を伴う結婚、妊娠・出産、子育てに温かい社会づくり・気運醸成","実施要領別記１第２の３（２）アに規定する事業内容となっているか。","複数の自治体により構成されるライフデザイン・結婚支援その他の少子化対策に関して地域が抱える課題を解決する場（協議会等）を設けているか。","協議会等を構成する自治体による「実質的な協働」(費用、役務の分担)が認められるものであるか。"]
[null,null,null,null,"3_2_2 地域全体で結婚・子育てを応援する気運醸成","実施要領別記１第２の３（２）イに規定する事業内容となっているか。"]
[null,null,null,null,"3_2_3 育児休業取得と家事・育児分担の促進","実施要領別記１第２の３（２）ウに規定する事業内容となっているか。"]
[null,null,null,null,"3_2_4 子育てと仕事の両立と多様な働き方の促進","実施要領別記１第２の３（２）エに規定する事業内容となっているか。"]
[null,null,null,null,"3_2_5 ICT活用、官民連携等による結婚支援等の更なる推進のための調査研究","実施要領別記１第２の３（２）オに規定する事業内容となっているか。"]

{"sheet":"自治体CD","index":7,"n_rows":1789,"n_cols":5,"rows_kept":1789,"cut":false,"hidden":true,"merged":[]}
["団体コード","都道府県名\n（漢字）","市区町村名\n（漢字）","都道府県名\n（カナ）","市区町村名\n（カナ）"]
["010006","北海道",null,"ﾎｯｶｲﾄﾞｳ"]
["011002","北海道","札幌市","ﾎｯｶｲﾄﾞｳ","ｻｯﾎﾟﾛｼ"]
["012025","北海道","函館市","ﾎｯｶｲﾄﾞｳ","ﾊｺﾀﾞﾃｼ"]
["012033","北海道","小樽市","ﾎｯｶｲﾄﾞｳ","ｵﾀﾙｼ"]
["012041","北海道","旭川市","ﾎｯｶｲﾄﾞｳ","ｱｻﾋｶﾜｼ"]
["012050","北海道","室蘭市","ﾎｯｶｲﾄﾞｳ","ﾑﾛﾗﾝｼ"]
["012068","北海道","釧路市","ﾎｯｶｲﾄﾞｳ","ｸｼﾛｼ"]
["012076","北海道","帯広市","ﾎｯｶｲﾄﾞｳ","ｵﾋﾞﾋﾛｼ"]
["012084","北海道","北見市","ﾎｯｶｲﾄﾞｳ","ｷﾀﾐｼ"]
["012092","北海道","夕張市","ﾎｯｶｲﾄﾞｳ","ﾕｳﾊﾞﾘｼ"]
["012106","北海道","岩見沢市","ﾎｯｶｲﾄﾞｳ","ｲﾜﾐｻﾞﾜｼ"]
["012114","北海道","網走市","ﾎｯｶｲﾄﾞｳ","ｱﾊﾞｼﾘｼ"]
["012122","北海道","留萌市","ﾎｯｶｲﾄﾞｳ","ﾙﾓｲｼ"]
["012131","北海道","苫小牧市","ﾎｯｶｲﾄﾞｳ","ﾄﾏｺﾏｲｼ"]
["012149","北海道","稚内市","ﾎｯｶｲﾄﾞｳ","ﾜｯｶﾅｲｼ"]
["012157","北海道","美唄市","ﾎｯｶｲﾄﾞｳ","ﾋﾞﾊﾞｲｼ"]
["012165","北海道","芦別市","ﾎｯｶｲﾄﾞｳ","ｱｼﾍﾞﾂｼ"]
["012173","北海道","江別市","ﾎｯｶｲﾄﾞｳ","ｴﾍﾞﾂｼ"]
["012181","北海道","赤平市","ﾎｯｶｲﾄﾞｳ","ｱｶﾋﾞﾗｼ"]
["012190","北海道","紋別市","ﾎｯｶｲﾄﾞｳ","ﾓﾝﾍﾞﾂｼ"]
["012203","北海道","士別市","ﾎｯｶｲﾄﾞｳ","ｼﾍﾞﾂｼ"]
["012211","北海道","名寄市","ﾎｯｶｲﾄﾞｳ","ﾅﾖﾛｼ"]
["012220","北海道","三笠市","ﾎｯｶｲﾄﾞｳ","ﾐｶｻｼ"]
["012238","北海道","根室市","ﾎｯｶｲﾄﾞｳ","ﾈﾑﾛｼ"]
["012246","北海道","千歳市","ﾎｯｶｲﾄﾞｳ","ﾁﾄｾｼ"]
["012254","北海道","滝川市","ﾎｯｶｲﾄﾞｳ","ﾀｷｶﾜｼ"]
["012262","北海道","砂川市","ﾎｯｶｲﾄﾞｳ","ｽﾅｶﾞﾜｼ"]
["012271","北海道","歌志内市","ﾎｯｶｲﾄﾞｳ","ｳﾀｼﾅｲｼ"]
["012289","北海道","深川市","ﾎｯｶｲﾄﾞｳ","ﾌｶｶﾞﾜｼ"]
["012297","北海道","富良野市","ﾎｯｶｲﾄﾞｳ","ﾌﾗﾉｼ"]
["012301","北海道","登別市","ﾎｯｶｲﾄﾞｳ","ﾉﾎﾞﾘﾍﾞﾂｼ"]
["012319","北海道","恵庭市","ﾎｯｶｲﾄﾞｳ","ｴﾆﾜｼ"]
["012335","北海道","伊達市","ﾎｯｶｲﾄﾞｳ","ﾀﾞﾃｼ"]
["012343","北海道","北広島市","ﾎｯｶｲﾄﾞｳ","ｷﾀﾋﾛｼﾏｼ"]
["012351","北海道","石狩市","ﾎｯｶｲﾄﾞｳ","ｲｼｶﾘｼ"]
["012360","北海道","北斗市","ﾎｯｶｲﾄﾞｳ","ﾎｸﾄｼ"]
["013030","北海道","当別町","ﾎｯｶｲﾄﾞｳ","ﾄｳﾍﾞﾂﾁｮｳ"]
["013048","北海道","新篠津村","ﾎｯｶｲﾄﾞｳ","ｼﾝｼﾉﾂﾑﾗ"]
["013315","北海道","松前町","ﾎｯｶｲﾄﾞｳ","ﾏﾂﾏｴﾁｮｳ"]
["013323","北海道","福島町","ﾎｯｶｲﾄﾞｳ","ﾌｸｼﾏﾁｮｳ"]
["013331","北海道","知内町","ﾎｯｶｲﾄﾞｳ","ｼﾘｳﾁﾁｮｳ"]
["013340","北海道","木古内町","ﾎｯｶｲﾄﾞｳ","ｷｺﾅｲﾁｮｳ"]
["013374","北海道","七飯町","ﾎｯｶｲﾄﾞｳ","ﾅﾅｴﾁｮｳ"]
["013439","北海道","鹿部町","ﾎｯｶｲﾄﾞｳ","ｼｶﾍﾞﾁｮｳ"]
["013455","北海道","森町","ﾎｯｶｲﾄﾞｳ","ﾓﾘﾏﾁ"]
["013463","北海道","八雲町","ﾎｯｶｲﾄﾞｳ","ﾔｸﾓﾁｮｳ"]
["013471","北海道","長万部町","ﾎｯｶｲﾄﾞｳ","ｵｼｬﾏﾝﾍﾞﾁｮｳ"]
["013617","北海道","江差町","ﾎｯｶｲﾄﾞｳ","ｴｻｼﾁｮｳ"]
["013625","北海道","上ノ国町","ﾎｯｶｲﾄﾞｳ","ｶﾐﾉｸﾆﾁｮｳ"]
["013633","北海道","厚沢部町","ﾎｯｶｲﾄﾞｳ","ｱｯｻﾌﾞﾁｮｳ"]
["013641","北海道","乙部町","ﾎｯｶｲﾄﾞｳ","ｵﾄﾍﾞﾁｮｳ"]
["013676","北海道","奥尻町","ﾎｯｶｲﾄﾞｳ","ｵｸｼﾘﾁｮｳ"]
["013706","北海道","今金町","ﾎｯｶｲﾄﾞｳ","ｲﾏｶﾈﾁｮｳ"]
["013714","北海道","せたな町","ﾎｯｶｲﾄﾞｳ","ｾﾀﾅﾁｮｳ"]
["013919","北海道","島牧村","ﾎｯｶｲﾄﾞｳ","ｼﾏﾏｷﾑﾗ"]
["013927","北海道","寿都町","ﾎｯｶｲﾄﾞｳ","ｽｯﾂﾁｮｳ"]
["013935","北海道","黒松内町","ﾎｯｶｲﾄﾞｳ","ｸﾛﾏﾂﾅｲﾁｮｳ"]
["013943","北海道","蘭越町","ﾎｯｶｲﾄﾞｳ","ﾗﾝｺｼﾁｮｳ"]
["013951","北海道","ニセコ町","ﾎｯｶｲﾄﾞｳ","ﾆｾｺﾁｮｳ"]
["013960","北海道","真狩村","ﾎｯｶｲﾄﾞｳ","ﾏｯｶﾘﾑﾗ"]
["013978","北海道","留寿都村","ﾎｯｶｲﾄﾞｳ","ﾙｽﾂﾑﾗ"]
["013986","北海道","喜茂別町","ﾎｯｶｲﾄﾞｳ","ｷﾓﾍﾞﾂﾁｮｳ"]
["013994","北海道","京極町","ﾎｯｶｲﾄﾞｳ","ｷｮｳｺﾞｸﾁｮｳ"]
["014001","北海道","倶知安町","ﾎｯｶｲﾄﾞｳ","ｸｯﾁｬﾝﾁｮｳ"]
["014010","北海道","共和町","ﾎｯｶｲﾄﾞｳ","ｷｮｳﾜﾁｮｳ"]
["014028","北海道","岩内町","ﾎｯｶｲﾄﾞｳ","ｲﾜﾅｲﾁｮｳ"]
["014036","北海道","泊村","ﾎｯｶｲﾄﾞｳ","ﾄﾏﾘﾑﾗ"]
["014044","北海道","神恵内村","ﾎｯｶｲﾄﾞｳ","ｶﾓｴﾅｲﾑﾗ"]
["014052","北海道","積丹町","ﾎｯｶｲﾄﾞｳ","ｼｬｺﾀﾝﾁｮｳ"]
["014061","北海道","古平町","ﾎｯｶｲﾄﾞｳ","ﾌﾙﾋﾞﾗﾁｮｳ"]
["014079","北海道","仁木町","ﾎｯｶｲﾄﾞｳ","ﾆｷﾁｮｳ"]
["014087","北海道","余市町","ﾎｯｶｲﾄﾞｳ","ﾖｲﾁﾁｮｳ"]
["014095","北海道","赤井川村","ﾎｯｶｲﾄﾞｳ","ｱｶｲｶﾞﾜﾑﾗ"]
["014231","北海道","南幌町","ﾎｯｶｲﾄﾞｳ","ﾅﾝﾎﾟﾛﾁｮｳ"]
["014249","北海道","奈井江町","ﾎｯｶｲﾄﾞｳ","ﾅｲｴﾁｮｳ"]
["014257","北海道","上砂川町","ﾎｯｶｲﾄﾞｳ","ｶﾐｽﾅｶﾞﾜﾁｮｳ"]
["014273","北海道","由仁町","ﾎｯｶｲﾄﾞｳ","ﾕﾆﾁｮｳ"]
["014281","北海道","長沼町","ﾎｯｶｲﾄﾞｳ","ﾅｶﾞﾇﾏﾁｮｳ"]
["014290","北海道","栗山町","ﾎｯｶｲﾄﾞｳ","ｸﾘﾔﾏﾁｮｳ"]
["014303","北海道","月形町","ﾎｯｶｲﾄﾞｳ","ﾂｷｶﾞﾀﾁｮｳ"]
["014311","北海道","浦臼町","ﾎｯｶｲﾄﾞｳ","ｳﾗｳｽﾁｮｳ"]
["014320","北海道","新十津川町","ﾎｯｶｲﾄﾞｳ","ｼﾝﾄﾂｶﾜﾁｮｳ"]
["014338","北海道","妹背牛町","ﾎｯｶｲﾄﾞｳ","ﾓｾｳｼﾁｮｳ"]
["014346","北海道","秩父別町","ﾎｯｶｲﾄﾞｳ","ﾁｯﾌﾟﾍﾞﾂﾁｮｳ"]
["014362","北海道","雨竜町","ﾎｯｶｲﾄﾞｳ","ｳﾘｭｳﾁｮｳ"]
["014371","北海道","北竜町","ﾎｯｶｲﾄﾞｳ","ﾎｸﾘｭｳﾁｮｳ"]
["014389","北海道","沼田町","ﾎｯｶｲﾄﾞｳ","ﾇﾏﾀﾁｮｳ"]
["014524","北海道","鷹栖町","ﾎｯｶｲﾄﾞｳ","ﾀｶｽﾁｮｳ"]
["014532","北海道","東神楽町","ﾎｯｶｲﾄﾞｳ","ﾋｶﾞｼｶｸﾞﾗﾁｮｳ"]
["014541","北海道","当麻町","ﾎｯｶｲﾄﾞｳ","ﾄｳﾏﾁｮｳ"]
["014559","北海道","比布町","ﾎｯｶｲﾄﾞｳ","ﾋﾟｯﾌﾟﾁｮｳ"]
["014567","北海道","愛別町","ﾎｯｶｲﾄﾞｳ","ｱｲﾍﾞﾂﾁｮｳ"]
["014575","北海道","上川町","ﾎｯｶｲﾄﾞｳ","ｶﾐｶﾜﾁｮｳ"]
["014583","北海道","東川町","ﾎｯｶｲﾄﾞｳ","ﾋｶﾞｼｶﾜﾁｮｳ"]
["014591","北海道","美瑛町","ﾎｯｶｲﾄﾞｳ","ﾋﾞｴｲﾁｮｳ"]
["014605","北海道","上富良野町","ﾎｯｶｲﾄﾞｳ","ｶﾐﾌﾗﾉﾁｮｳ"]
["014613","北海道","中富良野町","ﾎｯｶｲﾄﾞｳ","ﾅｶﾌﾗﾉﾁｮｳ"]
["014621","北海道","南富良野町","ﾎｯｶｲﾄﾞｳ","ﾐﾅﾐﾌﾗﾉﾁｮｳ"]
["014630","北海道","占冠村","ﾎｯｶｲﾄﾞｳ","ｼﾑｶｯﾌﾟﾑﾗ"]
["014648","北海道","和寒町","ﾎｯｶｲﾄﾞｳ","ﾜｯｻﾑﾁｮｳ"]
["014656","北海道","剣淵町","ﾎｯｶｲﾄﾞｳ","ｹﾝﾌﾞﾁﾁｮｳ"]
["014681","北海道","下川町","ﾎｯｶｲﾄﾞｳ","ｼﾓｶﾜﾁｮｳ"]
["014699","北海道","美深町","ﾎｯｶｲﾄﾞｳ","ﾋﾞﾌｶﾁｮｳ"]
["014702","北海道","音威子府村","ﾎｯｶｲﾄﾞｳ","ｵﾄｲﾈｯﾌﾟﾑﾗ"]
["014711","北海道","中川町","ﾎｯｶｲﾄﾞｳ","ﾅｶｶﾞﾜﾁｮｳ"]
["014729","北海道","幌加内町","ﾎｯｶｲﾄﾞｳ","ﾎﾛｶﾅｲﾁｮｳ"]
["014818","北海道","増毛町","ﾎｯｶｲﾄﾞｳ","ﾏｼｹﾁｮｳ"]
["014826","北海道","小平町","ﾎｯｶｲﾄﾞｳ","ｵﾋﾞﾗﾁｮｳ"]
["014834","北海道","苫前町","ﾎｯｶｲﾄﾞｳ","ﾄﾏﾏｴﾁｮｳ"]
["014842","北海道","羽幌町","ﾎｯｶｲﾄﾞｳ","ﾊﾎﾞﾛﾁｮｳ"]
["014851","北海道","初山別村","ﾎｯｶｲﾄﾞｳ","ｼｮｻﾝﾍﾞﾂﾑﾗ"]
["014869","北海道","遠別町","ﾎｯｶｲﾄﾞｳ","ｴﾝﾍﾞﾂﾁｮｳ"]
["014877","北海道","天塩町","ﾎｯｶｲﾄﾞｳ","ﾃｼｵﾁｮｳ"]
["015113","北海道","猿払村","ﾎｯｶｲﾄﾞｳ","ｻﾙﾌﾂﾑﾗ"]
["015121","北海道","浜頓別町","ﾎｯｶｲﾄﾞｳ","ﾊﾏﾄﾝﾍﾞﾂﾁｮｳ"]
["015130","北海道","中頓別町","ﾎｯｶｲﾄﾞｳ","ﾅｶﾄﾝﾍﾞﾂﾁｮｳ"]
["015148","北海道","枝幸町","ﾎｯｶｲﾄﾞｳ","ｴｻｼﾁｮｳ"]
["015164","北海道","豊富町","ﾎｯｶｲﾄﾞｳ","ﾄﾖﾄﾐﾁｮｳ"]
["015172","北海道","礼文町","ﾎｯｶｲﾄﾞｳ","ﾚﾌﾞﾝﾁｮｳ"]
["015181","北海道","利尻町","ﾎｯｶｲﾄﾞｳ","ﾘｼﾘﾁｮｳ"]
["015199","北海道","利尻富士町","ﾎｯｶｲﾄﾞｳ","ﾘｼﾘﾌｼﾞﾁｮｳ"]
["015202","北海道","幌延町","ﾎｯｶｲﾄﾞｳ","ﾎﾛﾉﾍﾞﾁｮｳ"]
["015431","北海道","美幌町","ﾎｯｶｲﾄﾞｳ","ﾋﾞﾎﾛﾁｮｳ"]
["015440","北海道","津別町","ﾎｯｶｲﾄﾞｳ","ﾂﾍﾞﾂﾁｮｳ"]
["015458","北海道","斜里町","ﾎｯｶｲﾄﾞｳ","ｼｬﾘﾁｮｳ"]
["015466","北海道","清里町","ﾎｯｶｲﾄﾞｳ","ｷﾖｻﾄﾁｮｳ"]
["015474","北海道","小清水町","ﾎｯｶｲﾄﾞｳ","ｺｼﾐｽﾞﾁｮｳ"]
["015491","北海道","訓子府町","ﾎｯｶｲﾄﾞｳ","ｸﾝﾈｯﾌﾟﾁｮｳ"]
["015504","北海道","置戸町","ﾎｯｶｲﾄﾞｳ","ｵｹﾄﾁｮｳ"]
["015521","北海道","佐呂間町","ﾎｯｶｲﾄﾞｳ","ｻﾛﾏﾁｮｳ"]
["015555","北海道","遠軽町","ﾎｯｶｲﾄﾞｳ","ｴﾝｶﾞﾙﾁｮｳ"]
["015598","北海道","湧別町","ﾎｯｶｲﾄﾞｳ","ﾕｳﾍﾞﾂﾁｮｳ"]
["015601","北海道","滝上町","ﾎｯｶｲﾄﾞｳ","ﾀｷﾉｳｴﾁｮｳ"]
["015610","北海道","興部町","ﾎｯｶｲﾄﾞｳ","ｵｺｯﾍﾟﾁｮｳ"]
["015628","北海道","西興部村","ﾎｯｶｲﾄﾞｳ","ﾆｼｵｺｯﾍﾟﾑﾗ"]
["015636","北海道","雄武町","ﾎｯｶｲﾄﾞｳ","ｵｳﾑﾁｮｳ"]
["015644","北海道","大空町","ﾎｯｶｲﾄﾞｳ","ｵｵｿﾞﾗﾁｮｳ"]
["015717","北海道","豊浦町","ﾎｯｶｲﾄﾞｳ","ﾄﾖｳﾗﾁｮｳ"]
["015750","北海道","壮瞥町","ﾎｯｶｲﾄﾞｳ","ｿｳﾍﾞﾂﾁｮｳ"]
["015784","北海道","白老町","ﾎｯｶｲﾄﾞｳ","ｼﾗｵｲﾁｮｳ"]
["015814","北海道","厚真町","ﾎｯｶｲﾄﾞｳ","ｱﾂﾏﾁｮｳ"]
["015849","北海道","洞爺湖町","ﾎｯｶｲﾄﾞｳ","ﾄｳﾔｺﾁｮｳ"]
["015857","北海道","安平町","ﾎｯｶｲﾄﾞｳ","ｱﾋﾞﾗﾁｮｳ"]
["015865","北海道","むかわ町","ﾎｯｶｲﾄﾞｳ","ﾑｶﾜﾁｮｳ"]
["016012","北海道","日高町","ﾎｯｶｲﾄﾞｳ","ﾋﾀﾞｶﾁｮｳ"]
["016021","北海道","平取町","ﾎｯｶｲﾄﾞｳ","ﾋﾞﾗﾄﾘﾁｮｳ"]
["016047","北海道","新冠町","ﾎｯｶｲﾄﾞｳ","ﾆｲｶｯﾌﾟﾁｮｳ"]
["016071","北海道","浦河町","ﾎｯｶｲﾄﾞｳ","ｳﾗｶﾜﾁｮｳ"]
["016080","北海道","様似町","ﾎｯｶｲﾄﾞｳ","ｻﾏﾆﾁｮｳ"]
["016098","北海道","えりも町","ﾎｯｶｲﾄﾞｳ","ｴﾘﾓﾁｮｳ"]
["016101","北海道","新ひだか町","ﾎｯｶｲﾄﾞｳ","ｼﾝﾋﾀﾞｶﾁｮｳ"]
["016314","北海道","音更町","ﾎｯｶｲﾄﾞｳ","ｵﾄﾌｹﾁｮｳ"]
["016322","北海道","士幌町","ﾎｯｶｲﾄﾞｳ","ｼﾎﾛﾁｮｳ"]
["016331","北海道","上士幌町","ﾎｯｶｲﾄﾞｳ","ｶﾐｼﾎﾛﾁｮｳ"]
["016349","北海道","鹿追町","ﾎｯｶｲﾄﾞｳ","ｼｶｵｲﾁｮｳ"]
["016357","北海道","新得町","ﾎｯｶｲﾄﾞｳ","ｼﾝﾄｸﾁｮｳ"]
["016365","北海道","清水町","ﾎｯｶｲﾄﾞｳ","ｼﾐｽﾞﾁｮｳ"]
["016373","北海道","芽室町","ﾎｯｶｲﾄﾞｳ","ﾒﾑﾛﾁｮｳ"]
["016381","北海道","中札内村","ﾎｯｶｲﾄﾞｳ","ﾅｶｻﾂﾅｲﾑﾗ"]
["016390","北海道","更別村","ﾎｯｶｲﾄﾞｳ","ｻﾗﾍﾞﾂﾑﾗ"]
["016411","北海道","大樹町","ﾎｯｶｲﾄﾞｳ","ﾀｲｷﾁｮｳ"]
["016420","北海道","広尾町","ﾎｯｶｲﾄﾞｳ","ﾋﾛｵﾁｮｳ"]
["016438","北海道","幕別町","ﾎｯｶｲﾄﾞｳ","ﾏｸﾍﾞﾂﾁｮｳ"]
["016446","北海道","池田町","ﾎｯｶｲﾄﾞｳ","ｲｹﾀﾞﾁｮｳ"]
["016454","北海道","豊頃町","ﾎｯｶｲﾄﾞｳ","ﾄﾖｺﾛﾁｮｳ"]
["016462","北海道","本別町","ﾎｯｶｲﾄﾞｳ","ﾎﾝﾍﾞﾂﾁｮｳ"]
["016471","北海道","足寄町","ﾎｯｶｲﾄﾞｳ","ｱｼｮﾛﾁｮｳ"]
["016489","北海道","陸別町","ﾎｯｶｲﾄﾞｳ","ﾘｸﾍﾞﾂﾁｮｳ"]
["016497","北海道","浦幌町","ﾎｯｶｲﾄﾞｳ","ｳﾗﾎﾛﾁｮｳ"]
["016616","北海道","釧路町","ﾎｯｶｲﾄﾞｳ","ｸｼﾛﾁｮｳ"]
["016624","北海道","厚岸町","ﾎｯｶｲﾄﾞｳ","ｱｯｹｼﾁｮｳ"]
["016632","北海道","浜中町","ﾎｯｶｲﾄﾞｳ","ﾊﾏﾅｶﾁｮｳ"]
["016641","北海道","標茶町","ﾎｯｶｲﾄﾞｳ","ｼﾍﾞﾁｬﾁｮｳ"]
["016659","北海道","弟子屈町","ﾎｯｶｲﾄﾞｳ","ﾃｼｶｶﾞﾁｮｳ"]
["016675","北海道","鶴居村","ﾎｯｶｲﾄﾞｳ","ﾂﾙｲﾑﾗ"]
["016683","北海道","白糠町","ﾎｯｶｲﾄﾞｳ","ｼﾗﾇｶﾁｮｳ"]
["016918","北海道","別海町","ﾎｯｶｲﾄﾞｳ","ﾍﾞﾂｶｲﾁｮｳ"]
["016926","北海道","中標津町","ﾎｯｶｲﾄﾞｳ","ﾅｶｼﾍﾞﾂﾁｮｳ"]
["016934","北海道","標津町","ﾎｯｶｲﾄﾞｳ","ｼﾍﾞﾂﾁｮｳ"]
["016942","北海道","羅臼町","ﾎｯｶｲﾄﾞｳ","ﾗｳｽﾁｮｳ"]
["020001","青森県",null,"ｱｵﾓﾘｹﾝ"]
["022012","青森県","青森市","ｱｵﾓﾘｹﾝ","ｱｵﾓﾘｼ"]
["022021","青森県","弘前市","ｱｵﾓﾘｹﾝ","ﾋﾛｻｷｼ"]
["022039","青森県","八戸市","ｱｵﾓﾘｹﾝ","ﾊﾁﾉﾍｼ"]
["022047","青森県","黒石市","ｱｵﾓﾘｹﾝ","ｸﾛｲｼｼ"]
["022055","青森県","五所川原市","ｱｵﾓﾘｹﾝ","ｺﾞｼｮｶﾞﾜﾗｼ"]
["022063","青森県","十和田市","ｱｵﾓﾘｹﾝ","ﾄﾜﾀﾞｼ"]
["022071","青森県","三沢市","ｱｵﾓﾘｹﾝ","ﾐｻﾜｼ"]
["022080","青森県","むつ市","ｱｵﾓﾘｹﾝ","ﾑﾂｼ"]
["022098","青森県","つがる市","ｱｵﾓﾘｹﾝ","ﾂｶﾞﾙｼ"]
["022101","青森県","平川市","ｱｵﾓﾘｹﾝ","ﾋﾗｶﾜｼ"]
["023019","青森県","平内町","ｱｵﾓﾘｹﾝ","ﾋﾗﾅｲﾏﾁ"]
["023035","青森県","今別町","ｱｵﾓﾘｹﾝ","ｲﾏﾍﾞﾂﾏﾁ"]
["023043","青森県","蓬田村","ｱｵﾓﾘｹﾝ","ﾖﾓｷﾞﾀﾑﾗ"]
["023078","青森県","外ヶ浜町","ｱｵﾓﾘｹﾝ","ｿﾄｶﾞﾊﾏﾏﾁ"]
["023213","青森県","鰺ヶ沢町","ｱｵﾓﾘｹﾝ","ｱｼﾞｶﾞｻﾜﾏﾁ"]
["023230","青森県","深浦町","ｱｵﾓﾘｹﾝ","ﾌｶｳﾗﾏﾁ"]
["023434","青森県","西目屋村","ｱｵﾓﾘｹﾝ","ﾆｼﾒﾔﾑﾗ"]
["023612","青森県","藤崎町","ｱｵﾓﾘｹﾝ","ﾌｼﾞｻｷﾏﾁ"]
["023621","青森県","大鰐町","ｱｵﾓﾘｹﾝ","ｵｵﾜﾆﾏﾁ"]
["023671","青森県","田舎館村","ｱｵﾓﾘｹﾝ","ｲﾅｶﾀﾞﾃﾑﾗ"]
["023817","青森県","板柳町","ｱｵﾓﾘｹﾝ","ｲﾀﾔﾅｷﾞﾏﾁ"]
["023841","青森県","鶴田町","ｱｵﾓﾘｹﾝ","ﾂﾙﾀﾏﾁ"]
["023876","青森県","中泊町","ｱｵﾓﾘｹﾝ","ﾅｶﾄﾞﾏﾘﾏﾁ"]
["024015","青森県","野辺地町","ｱｵﾓﾘｹﾝ","ﾉﾍｼﾞﾏﾁ"]
["024023","青森県","七戸町","ｱｵﾓﾘｹﾝ","ｼﾁﾉﾍﾏﾁ"]
["024058","青森県","六戸町","ｱｵﾓﾘｹﾝ","ﾛｸﾉﾍﾏﾁ"]
["024066","青森県","横浜町","ｱｵﾓﾘｹﾝ","ﾖｺﾊﾏﾏﾁ"]
["024082","青森県","東北町","ｱｵﾓﾘｹﾝ","ﾄｳﾎｸﾏﾁ"]
["024112","青森県","六ヶ所村","ｱｵﾓﾘｹﾝ","ﾛｯｶｼｮﾑﾗ"]
["024121","青森県","おいらせ町","ｱｵﾓﾘｹﾝ","ｵｲﾗｾﾁｮｳ"]
["024236","青森県","大間町","ｱｵﾓﾘｹﾝ","ｵｵﾏﾏﾁ"]
["024244","青森県","東通村","ｱｵﾓﾘｹﾝ","ﾋｶﾞｼﾄﾞｵﾘﾑﾗ"]
["024252","青森県","風間浦村","ｱｵﾓﾘｹﾝ","ｶｻﾞﾏｳﾗﾑﾗ"]
["024261","青森県","佐井村","ｱｵﾓﾘｹﾝ","ｻｲﾑﾗ"]
["024414","青森県","三戸町","ｱｵﾓﾘｹﾝ","ｻﾝﾉﾍﾏﾁ"]
["024422","青森県","五戸町","ｱｵﾓﾘｹﾝ","ｺﾞﾉﾍﾏﾁ"]
["024431","青森県","田子町","ｱｵﾓﾘｹﾝ","ﾀｯｺﾏﾁ"]
["024457","青森県","南部町","ｱｵﾓﾘｹﾝ","ﾅﾝﾌﾞﾁｮｳ"]
["024465","青森県","階上町","ｱｵﾓﾘｹﾝ","ﾊｼｶﾐﾁｮｳ"]
["024503","青森県","新郷村","ｱｵﾓﾘｹﾝ","ｼﾝｺﾞｳﾑﾗ"]
["030007","岩手県",null,"ｲﾜﾃｹﾝ"]
["032018","岩手県","盛岡市","ｲﾜﾃｹﾝ","ﾓﾘｵｶｼ"]
["032026","岩手県","宮古市","ｲﾜﾃｹﾝ","ﾐﾔｺｼ"]
["032034","岩手県","大船渡市","ｲﾜﾃｹﾝ","ｵｵﾌﾅﾄｼ"]
["032051","岩手県","花巻市","ｲﾜﾃｹﾝ","ﾊﾅﾏｷｼ"]
["032069","岩手県","北上市","ｲﾜﾃｹﾝ","ｷﾀｶﾐｼ"]
["032077","岩手県","久慈市","ｲﾜﾃｹﾝ","ｸｼﾞｼ"]
["032085","岩手県","遠野市","ｲﾜﾃｹﾝ","ﾄｵﾉｼ"]
["032093","岩手県","一関市","ｲﾜﾃｹﾝ","ｲﾁﾉｾｷｼ"]
["032107","岩手県","陸前高田市","ｲﾜﾃｹﾝ","ﾘｸｾﾞﾝﾀｶﾀｼ"]
["032115","岩手県","釜石市","ｲﾜﾃｹﾝ","ｶﾏｲｼｼ"]
["032131","岩手県","二戸市","ｲﾜﾃｹﾝ","ﾆﾉﾍｼ"]
["032140","岩手県","八幡平市","ｲﾜﾃｹﾝ","ﾊﾁﾏﾝﾀｲｼ"]
["032158","岩手県","奥州市","ｲﾜﾃｹﾝ","ｵｳｼｭｳｼ"]
["032166","岩手県","滝沢市","ｲﾜﾃｹﾝ","ﾀｷｻﾞﾜｼ"]
["033014","岩手県","雫石町","ｲﾜﾃｹﾝ","ｼｽﾞｸｲｼﾁｮｳ"]
["033022","岩手県","葛巻町","ｲﾜﾃｹﾝ","ｸｽﾞﾏｷﾏﾁ"]
["033031","岩手県","岩手町","ｲﾜﾃｹﾝ","ｲﾜﾃﾏﾁ"]
["033219","岩手県","紫波町","ｲﾜﾃｹﾝ","ｼﾜﾁｮｳ"]
["033227","岩手県","矢巾町","ｲﾜﾃｹﾝ","ﾔﾊﾊﾞﾁｮｳ"]
["033669","岩手県","西和賀町","ｲﾜﾃｹﾝ","ﾆｼﾜｶﾞﾏﾁ"]
["033812","岩手県","金ケ崎町","ｲﾜﾃｹﾝ","ｶﾈｶﾞｻｷﾁｮｳ"]
["034029","岩手県","平泉町","ｲﾜﾃｹﾝ","ﾋﾗｲｽﾞﾐﾁｮｳ"]
["034410","岩手県","住田町","ｲﾜﾃｹﾝ","ｽﾐﾀﾁｮｳ"]
["034614","岩手県","大槌町","ｲﾜﾃｹﾝ","ｵｵﾂﾁﾁｮｳ"]
["034827","岩手県","山田町","ｲﾜﾃｹﾝ","ﾔﾏﾀﾞﾏﾁ"]
["034835","岩手県","岩泉町","ｲﾜﾃｹﾝ","ｲﾜｲｽﾞﾐﾁｮｳ"]
["034843","岩手県","田野畑村","ｲﾜﾃｹﾝ","ﾀﾉﾊﾀﾑﾗ"]
["034851","岩手県","普代村","ｲﾜﾃｹﾝ","ﾌﾀﾞｲﾑﾗ"]
["035017","岩手県","軽米町","ｲﾜﾃｹﾝ","ｶﾙﾏｲﾏﾁ"]
["035033","岩手県","野田村","ｲﾜﾃｹﾝ","ﾉﾀﾞﾑﾗ"]
["035068","岩手県","九戸村","ｲﾜﾃｹﾝ","ｸﾉﾍﾑﾗ"]
["035076","岩手県","洋野町","ｲﾜﾃｹﾝ","ﾋﾛﾉﾁｮｳ"]
["035246","岩手県","一戸町","ｲﾜﾃｹﾝ","ｲﾁﾉﾍﾏﾁ"]
["040002","宮城県",null,"ﾐﾔｷﾞｹﾝ"]
["041009","宮城県","仙台市","ﾐﾔｷﾞｹﾝ","ｾﾝﾀﾞｲｼ"]
["042021","宮城県","石巻市","ﾐﾔｷﾞｹﾝ","ｲｼﾉﾏｷｼ"]
["042030","宮城県","塩竈市","ﾐﾔｷﾞｹﾝ","ｼｵｶﾞﾏｼ"]
["042056","宮城県","気仙沼市","ﾐﾔｷﾞｹﾝ","ｹｾﾝﾇﾏｼ"]
["042064","宮城県","白石市","ﾐﾔｷﾞｹﾝ","ｼﾛｲｼｼ"]
["042072","宮城県","名取市","ﾐﾔｷﾞｹﾝ","ﾅﾄﾘｼ"]
["042081","宮城県","角田市","ﾐﾔｷﾞｹﾝ","ｶｸﾀﾞｼ"]
["042099","宮城県","多賀城市","ﾐﾔｷﾞｹﾝ","ﾀｶﾞｼﾞｮｳｼ"]
["042111","宮城県","岩沼市","ﾐﾔｷﾞｹﾝ","ｲﾜﾇﾏｼ"]
["042129","宮城県","登米市","ﾐﾔｷﾞｹﾝ","ﾄﾒｼ"]
["042137","宮城県","栗原市","ﾐﾔｷﾞｹﾝ","ｸﾘﾊﾗｼ"]
["042145","宮城県","東松島市","ﾐﾔｷﾞｹﾝ","ﾋｶﾞｼﾏﾂｼﾏｼ"]
["042153","宮城県","大崎市","ﾐﾔｷﾞｹﾝ","ｵｵｻｷｼ"]
["042161","宮城県","富谷市","ﾐﾔｷﾞｹﾝ","ﾄﾐﾔｼ"]
["043010","宮城県","蔵王町","ﾐﾔｷﾞｹﾝ","ｻﾞｵｳﾏﾁ"]
["043028","宮城県","七ヶ宿町","ﾐﾔｷﾞｹﾝ","ｼﾁｶｼｭｸﾏﾁ"]
["043214","宮城県","大河原町","ﾐﾔｷﾞｹﾝ","ｵｵｶﾞﾜﾗﾏﾁ"]
["043222","宮城県","村田町","ﾐﾔｷﾞｹﾝ","ﾑﾗﾀﾏﾁ"]
["043231","宮城県","柴田町","ﾐﾔｷﾞｹﾝ","ｼﾊﾞﾀﾏﾁ"]
["043249","宮城県","川崎町","ﾐﾔｷﾞｹﾝ","ｶﾜｻｷﾏﾁ"]
["043419","宮城県","丸森町","ﾐﾔｷﾞｹﾝ","ﾏﾙﾓﾘﾏﾁ"]
["043613","宮城県","亘理町","ﾐﾔｷﾞｹﾝ","ﾜﾀﾘﾁｮｳ"]
["043621","宮城県","山元町","ﾐﾔｷﾞｹﾝ","ﾔﾏﾓﾄﾁｮｳ"]
["044016","宮城県","松島町","ﾐﾔｷﾞｹﾝ","ﾏﾂｼﾏﾏﾁ"]
["044041","宮城県","七ヶ浜町","ﾐﾔｷﾞｹﾝ","ｼﾁｶﾞﾊﾏﾏﾁ"]
["044067","宮城県","利府町","ﾐﾔｷﾞｹﾝ","ﾘﾌﾁｮｳ"]
["044211","宮城県","大和町","ﾐﾔｷﾞｹﾝ","ﾀｲﾜﾁｮｳ"]
["044229","宮城県","大郷町","ﾐﾔｷﾞｹﾝ","ｵｵｻﾄﾁｮｳ"]
["044245","宮城県","大衡村","ﾐﾔｷﾞｹﾝ","ｵｵﾋﾗﾑﾗ"]
["044440","宮城県","色麻町","ﾐﾔｷﾞｹﾝ","ｼｶﾏﾁｮｳ"]
["044458","宮城県","加美町","ﾐﾔｷﾞｹﾝ","ｶﾐﾏﾁ"]
["045012","宮城県","涌谷町","ﾐﾔｷﾞｹﾝ","ﾜｸﾔﾁｮｳ"]
["045055","宮城県","美里町","ﾐﾔｷﾞｹﾝ","ﾐｻﾄﾏﾁ"]
["045811","宮城県","女川町","ﾐﾔｷﾞｹﾝ","ｵﾅｶﾞﾜﾁｮｳ"]
["046060","宮城県","南三陸町","ﾐﾔｷﾞｹﾝ","ﾐﾅﾐｻﾝﾘｸﾁｮｳ"]
["050008","秋田県",null,"ｱｷﾀｹﾝ"]
["052019","秋田県","秋田市","ｱｷﾀｹﾝ","ｱｷﾀｼ"]
["052027","秋田県","能代市","ｱｷﾀｹﾝ","ﾉｼﾛｼ"]
["052035","秋田県","横手市","ｱｷﾀｹﾝ","ﾖｺﾃｼ"]
["052043","秋田県","大館市","ｱｷﾀｹﾝ","ｵｵﾀﾞﾃｼ"]
["052060","秋田県","男鹿市","ｱｷﾀｹﾝ","ｵｶﾞｼ"]
["052078","秋田県","湯沢市","ｱｷﾀｹﾝ","ﾕｻﾞﾜｼ"]
["052094","秋田県","鹿角市","ｱｷﾀｹﾝ","ｶﾂﾞﾉｼ"]
["052108","秋田県","由利本荘市","ｱｷﾀｹﾝ","ﾕﾘﾎﾝｼﾞｮｳｼ"]
["052116","秋田県","潟上市","ｱｷﾀｹﾝ","ｶﾀｶﾞﾐｼ"]
["052124","秋田県","大仙市","ｱｷﾀｹﾝ","ﾀﾞｲｾﾝｼ"]
["052132","秋田県","北秋田市","ｱｷﾀｹﾝ","ｷﾀｱｷﾀｼ"]
["052141","秋田県","にかほ市","ｱｷﾀｹﾝ","ﾆｶﾎｼ"]
["052159","秋田県","仙北市","ｱｷﾀｹﾝ","ｾﾝﾎﾞｸｼ"]
["053031","秋田県","小坂町","ｱｷﾀｹﾝ","ｺｻｶﾏﾁ"]
["053279","秋田県","上小阿仁村","ｱｷﾀｹﾝ","ｶﾐｺｱﾆﾑﾗ"]
["053465","秋田県","藤里町","ｱｷﾀｹﾝ","ﾌｼﾞｻﾄﾏﾁ"]
["053481","秋田県","三種町","ｱｷﾀｹﾝ","ﾐﾀﾈﾁｮｳ"]
["053490","秋田県","八峰町","ｱｷﾀｹﾝ","ﾊｯﾎﾟｳﾁｮｳ"]
["053619","秋田県","五城目町","ｱｷﾀｹﾝ","ｺﾞｼﾞｮｳﾒﾏﾁ"]
["053635","秋田県","八郎潟町","ｱｷﾀｹﾝ","ﾊﾁﾛｳｶﾞﾀﾏﾁ"]
["053660","秋田県","井川町","ｱｷﾀｹﾝ","ｲｶﾜﾏﾁ"]
["053686","秋田県","大潟村","ｱｷﾀｹﾝ","ｵｵｶﾞﾀﾑﾗ"]
["054348","秋田県","美郷町","ｱｷﾀｹﾝ","ﾐｻﾄﾁｮｳ"]
["054631","秋田県","羽後町","ｱｷﾀｹﾝ","ｳｺﾞﾏﾁ"]
["054640","秋田県","東成瀬村","ｱｷﾀｹﾝ","ﾋｶﾞｼﾅﾙｾﾑﾗ"]
["060003","山形県",null,"ﾔﾏｶﾞﾀｹﾝ"]
["062014","山形県","山形市","ﾔﾏｶﾞﾀｹﾝ","ﾔﾏｶﾞﾀｼ"]
["062022","山形県","米沢市","ﾔﾏｶﾞﾀｹﾝ","ﾖﾈｻﾞﾜｼ"]
["062031","山形県","鶴岡市","ﾔﾏｶﾞﾀｹﾝ","ﾂﾙｵｶｼ"]
["062049","山形県","酒田市","ﾔﾏｶﾞﾀｹﾝ","ｻｶﾀｼ"]
["062057","山形県","新庄市","ﾔﾏｶﾞﾀｹﾝ","ｼﾝｼﾞｮｳｼ"]
["062065","山形県","寒河江市","ﾔﾏｶﾞﾀｹﾝ","ｻｶﾞｴｼ"]
["062073","山形県","上山市","ﾔﾏｶﾞﾀｹﾝ","ｶﾐﾉﾔﾏｼ"]
["062081","山形県","村山市","ﾔﾏｶﾞﾀｹﾝ","ﾑﾗﾔﾏｼ"]
["062090","山形県","長井市","ﾔﾏｶﾞﾀｹﾝ","ﾅｶﾞｲｼ"]
["062103","山形県","天童市","ﾔﾏｶﾞﾀｹﾝ","ﾃﾝﾄﾞｳｼ"]
["062111","山形県","東根市","ﾔﾏｶﾞﾀｹﾝ","ﾋｶﾞｼﾈｼ"]
["062120","山形県","尾花沢市","ﾔﾏｶﾞﾀｹﾝ","ｵﾊﾞﾅｻﾞﾜｼ"]
["062138","山形県","南陽市","ﾔﾏｶﾞﾀｹﾝ","ﾅﾝﾖｳｼ"]
["063011","山形県","山辺町","ﾔﾏｶﾞﾀｹﾝ","ﾔﾏﾉﾍﾞﾏﾁ"]
["063029","山形県","中山町","ﾔﾏｶﾞﾀｹﾝ","ﾅｶﾔﾏﾏﾁ"]
["063215","山形県","河北町","ﾔﾏｶﾞﾀｹﾝ","ｶﾎｸﾁｮｳ"]
["063223","山形県","西川町","ﾔﾏｶﾞﾀｹﾝ","ﾆｼｶﾜﾏﾁ"]
["063231","山形県","朝日町","ﾔﾏｶﾞﾀｹﾝ","ｱｻﾋﾏﾁ"]
["063240","山形県","大江町","ﾔﾏｶﾞﾀｹﾝ","ｵｵｴﾏﾁ"]
["063410","山形県","大石田町","ﾔﾏｶﾞﾀｹﾝ","ｵｵｲｼﾀﾞﾏﾁ"]
["063614","山形県","金山町","ﾔﾏｶﾞﾀｹﾝ","ｶﾈﾔﾏﾏﾁ"]
["063622","山形県","最上町","ﾔﾏｶﾞﾀｹﾝ","ﾓｶﾞﾐﾏﾁ"]
["063631","山形県","舟形町","ﾔﾏｶﾞﾀｹﾝ","ﾌﾅｶﾞﾀﾏﾁ"]
["063649","山形県","真室川町","ﾔﾏｶﾞﾀｹﾝ","ﾏﾑﾛｶﾞﾜﾏﾁ"]
["063657","山形県","大蔵村","ﾔﾏｶﾞﾀｹﾝ","ｵｵｸﾗﾑﾗ"]
["063665","山形県","鮭川村","ﾔﾏｶﾞﾀｹﾝ","ｻｹｶﾞﾜﾑﾗ"]
["063673","山形県","戸沢村","ﾔﾏｶﾞﾀｹﾝ","ﾄｻﾞﾜﾑﾗ"]
["063819","山形県","高畠町","ﾔﾏｶﾞﾀｹﾝ","ﾀｶﾊﾀﾏﾁ"]
["063827","山形県","川西町","ﾔﾏｶﾞﾀｹﾝ","ｶﾜﾆｼﾏﾁ"]
["064017","山形県","小国町","ﾔﾏｶﾞﾀｹﾝ","ｵｸﾞﾆﾏﾁ"]
["064025","山形県","白鷹町","ﾔﾏｶﾞﾀｹﾝ","ｼﾗﾀｶﾏﾁ"]
["064033","山形県","飯豊町","ﾔﾏｶﾞﾀｹﾝ","ｲｲﾃﾞﾏﾁ"]
["064262","山形県","三川町","ﾔﾏｶﾞﾀｹﾝ","ﾐｶﾜﾏﾁ"]
["064289","山形県","庄内町","ﾔﾏｶﾞﾀｹﾝ","ｼﾖｳﾅｲﾏﾁ"]
["064611","山形県","遊佐町","ﾔﾏｶﾞﾀｹﾝ","ﾕｻﾞﾏﾁ"]
["070009","福島県",null,"ﾌｸｼﾏｹﾝ"]
["072010","福島県","福島市","ﾌｸｼﾏｹﾝ","ﾌｸｼﾏｼ"]
["072028","福島県","会津若松市","ﾌｸｼﾏｹﾝ","ｱｲﾂﾞﾜｶﾏﾂｼ"]
["072036","福島県","郡山市","ﾌｸｼﾏｹﾝ","ｺｵﾘﾔﾏｼ"]
["072044","福島県","いわき市","ﾌｸｼﾏｹﾝ","ｲﾜｷｼ"]
["072052","福島県","白河市","ﾌｸｼﾏｹﾝ","ｼﾗｶﾜｼ"]
["072079","福島県","須賀川市","ﾌｸｼﾏｹﾝ","ｽｶｶﾞﾜｼ"]
["072087","福島県","喜多方市","ﾌｸｼﾏｹﾝ","ｷﾀｶﾀｼ"]
["072095","福島県","相馬市","ﾌｸｼﾏｹﾝ","ｿｳﾏｼ"]
["072109","福島県","二本松市","ﾌｸｼﾏｹﾝ","ﾆﾎﾝﾏﾂｼ"]
["072117","福島県","田村市","ﾌｸｼﾏｹﾝ","ﾀﾑﾗｼ"]
["072125","福島県","南相馬市","ﾌｸｼﾏｹﾝ","ﾐﾅﾐｿｳﾏｼ"]
["072133","福島県","伊達市","ﾌｸｼﾏｹﾝ","ﾀﾞﾃｼ"]
["072141","福島県","本宮市","ﾌｸｼﾏｹﾝ","ﾓﾄﾐﾔｼ"]
["073016","福島県","桑折町","ﾌｸｼﾏｹﾝ","ｺｵﾘﾏﾁ"]
["073032","福島県","国見町","ﾌｸｼﾏｹﾝ","ｸﾆﾐﾏﾁ"]
["073083","福島県","川俣町","ﾌｸｼﾏｹﾝ","ｶﾜﾏﾀﾏﾁ"]
["073229","福島県","大玉村","ﾌｸｼﾏｹﾝ","ｵｵﾀﾏﾑﾗ"]
["073423","福島県","鏡石町","ﾌｸｼﾏｹﾝ","ｶｶﾞﾐｲｼﾏﾁ"]
["073440","福島県","天栄村","ﾌｸｼﾏｹﾝ","ﾃﾝｴｲﾑﾗ"]
["073628","福島県","下郷町","ﾌｸｼﾏｹﾝ","ｼﾓｺﾞｳﾏﾁ"]
["073644","福島県","檜枝岐村","ﾌｸｼﾏｹﾝ","ﾋﾉｴﾏﾀﾑﾗ"]
["073679","福島県","只見町","ﾌｸｼﾏｹﾝ","ﾀﾀﾞﾐﾏﾁ"]
["073687","福島県","南会津町","ﾌｸｼﾏｹﾝ","ﾐﾅﾐｱｲﾂﾞﾏﾁ"]
["074021","福島県","北塩原村","ﾌｸｼﾏｹﾝ","ｷﾀｼｵﾊﾞﾗﾑﾗ"]
["074055","福島県","西会津町","ﾌｸｼﾏｹﾝ","ﾆｼｱｲﾂﾞﾏﾁ"]
["074071","福島県","磐梯町","ﾌｸｼﾏｹﾝ","ﾊﾞﾝﾀﾞｲﾏﾁ"]
["074080","福島県","猪苗代町","ﾌｸｼﾏｹﾝ","ｲﾅﾜｼﾛﾏﾁ"]
["074217","福島県","会津坂下町","ﾌｸｼﾏｹﾝ","ｱｲﾂﾞﾊﾞﾝｹﾞﾏﾁ"]
["074225","福島県","湯川村","ﾌｸｼﾏｹﾝ","ﾕｶﾞﾜﾑﾗ"]
["074233","福島県","柳津町","ﾌｸｼﾏｹﾝ","ﾔﾅｲﾂﾞﾏﾁ"]
["074446","福島県","三島町","ﾌｸｼﾏｹﾝ","ﾐｼﾏﾏﾁ"]
["074454","福島県","金山町","ﾌｸｼﾏｹﾝ","ｶﾈﾔﾏﾏﾁ"]
["074462","福島県","昭和村","ﾌｸｼﾏｹﾝ","ｼｮｳﾜﾑﾗ"]
["074471","福島県","会津美里町","ﾌｸｼﾏｹﾝ","ｱｲﾂﾞﾐｻﾄﾏﾁ"]
["074616","福島県","西郷村","ﾌｸｼﾏｹﾝ","ﾆｼｺﾞｳﾑﾗ"]
["074641","福島県","泉崎村","ﾌｸｼﾏｹﾝ","ｲｽﾞﾐｻﾞｷﾑﾗ"]
["074659","福島県","中島村","ﾌｸｼﾏｹﾝ","ﾅｶｼﾞﾏﾑﾗ"]
["074667","福島県","矢吹町","ﾌｸｼﾏｹﾝ","ﾔﾌﾞｷﾏﾁ"]
["074811","福島県","棚倉町","ﾌｸｼﾏｹﾝ","ﾀﾅｸﾞﾗﾏﾁ"]
["074829","福島県","矢祭町","ﾌｸｼﾏｹﾝ","ﾔﾏﾂﾘﾏﾁ"]
["074837","福島県","塙町","ﾌｸｼﾏｹﾝ","ﾊﾅﾜﾏﾁ"]
["074845","福島県","鮫川村","ﾌｸｼﾏｹﾝ","ｻﾒｶﾞﾜﾑﾗ"]
["075019","福島県","石川町","ﾌｸｼﾏｹﾝ","ｲｼｶﾜﾏﾁ"]
["075027","福島県","玉川村","ﾌｸｼﾏｹﾝ","ﾀﾏｶﾜﾑﾗ"]
["075035","福島県","平田村","ﾌｸｼﾏｹﾝ","ﾋﾗﾀﾑﾗ"]
["075043","福島県","浅川町","ﾌｸｼﾏｹﾝ","ｱｻｶﾜﾏﾁ"]
["075051","福島県","古殿町","ﾌｸｼﾏｹﾝ","ﾌﾙﾄﾞﾉﾏﾁ"]
["075213","福島県","三春町","ﾌｸｼﾏｹﾝ","ﾐﾊﾙﾏﾁ"]
["075221","福島県","小野町","ﾌｸｼﾏｹﾝ","ｵﾉﾏﾁ"]
["075418","福島県","広野町","ﾌｸｼﾏｹﾝ","ﾋﾛﾉﾏﾁ"]
["075426","福島県","楢葉町","ﾌｸｼﾏｹﾝ","ﾅﾗﾊﾏﾁ"]
["075434","福島県","富岡町","ﾌｸｼﾏｹﾝ","ﾄﾐｵｶﾏﾁ"]
["075442","福島県","川内村","ﾌｸｼﾏｹﾝ","ｶﾜｳﾁﾑﾗ"]
["075451","福島県","大熊町","ﾌｸｼﾏｹﾝ","ｵｵｸﾏﾏﾁ"]
["075469","福島県","双葉町","ﾌｸｼﾏｹﾝ","ﾌﾀﾊﾞﾏﾁ"]
["075477","福島県","浪江町","ﾌｸｼﾏｹﾝ","ﾅﾐｴﾏﾁ"]
["075485","福島県","葛尾村","ﾌｸｼﾏｹﾝ","ｶﾂﾗｵﾑﾗ"]
["075612","福島県","新地町","ﾌｸｼﾏｹﾝ","ｼﾝﾁﾏﾁ"]
["075647","福島県","飯舘村","ﾌｸｼﾏｹﾝ","ｲｲﾀﾃﾑﾗ"]
["080004","茨城県",null,"ｲﾊﾞﾗｷｹﾝ"]
["082015","茨城県","水戸市","ｲﾊﾞﾗｷｹﾝ","ﾐﾄｼ"]
["082023","茨城県","日立市","ｲﾊﾞﾗｷｹﾝ","ﾋﾀﾁｼ"]
["082031","茨城県","土浦市","ｲﾊﾞﾗｷｹﾝ","ﾂﾁｳﾗｼ"]
["082040","茨城県","古河市","ｲﾊﾞﾗｷｹﾝ","ｺｶﾞｼ"]
["082058","茨城県","石岡市","ｲﾊﾞﾗｷｹﾝ","ｲｼｵｶｼ"]
["082074","茨城県","結城市","ｲﾊﾞﾗｷｹﾝ","ﾕｳｷｼ"]
["082082","茨城県","龍ケ崎市","ｲﾊﾞﾗｷｹﾝ","ﾘｭｳｶﾞｻｷｼ"]
["082104","茨城県","下妻市","ｲﾊﾞﾗｷｹﾝ","ｼﾓﾂﾏｼ"]
["082112","茨城県","常総市","ｲﾊﾞﾗｷｹﾝ","ｼﾞｮｳｿｳｼ"]
["082121","茨城県","常陸太田市","ｲﾊﾞﾗｷｹﾝ","ﾋﾀﾁｵｵﾀｼ"]
["082147","茨城県","高萩市","ｲﾊﾞﾗｷｹﾝ","ﾀｶﾊｷﾞｼ"]
["082155","茨城県","北茨城市","ｲﾊﾞﾗｷｹﾝ","ｷﾀｲﾊﾞﾗｷｼ"]
["082163","茨城県","笠間市","ｲﾊﾞﾗｷｹﾝ","ｶｻﾏｼ"]
["082171","茨城県","取手市","ｲﾊﾞﾗｷｹﾝ","ﾄﾘﾃﾞｼ"]
["082198","茨城県","牛久市","ｲﾊﾞﾗｷｹﾝ","ｳｼｸｼ"]
["082201","茨城県","つくば市","ｲﾊﾞﾗｷｹﾝ","ﾂｸﾊﾞｼ"]
["082210","茨城県","ひたちなか市","ｲﾊﾞﾗｷｹﾝ","ﾋﾀﾁﾅｶｼ"]
["082228","茨城県","鹿嶋市","ｲﾊﾞﾗｷｹﾝ","ｶｼﾏｼ"]
["082236","茨城県","潮来市","ｲﾊﾞﾗｷｹﾝ","ｲﾀｺｼ"]
["082244","茨城県","守谷市","ｲﾊﾞﾗｷｹﾝ","ﾓﾘﾔｼ"]
["082252","茨城県","常陸大宮市","ｲﾊﾞﾗｷｹﾝ","ﾋﾀﾁｵｵﾐﾔｼ"]
["082261","茨城県","那珂市","ｲﾊﾞﾗｷｹﾝ","ﾅｶｼ"]
["082279","茨城県","筑西市","ｲﾊﾞﾗｷｹﾝ","ﾁｸｾｲｼ"]
["082287","茨城県","坂東市","ｲﾊﾞﾗｷｹﾝ","ﾊﾞﾝﾄﾞｳｼ"]
["082295","茨城県","稲敷市","ｲﾊﾞﾗｷｹﾝ","ｲﾅｼｷｼ"]
["082309","茨城県","かすみがうら市","ｲﾊﾞﾗｷｹﾝ","ｶｽﾐｶﾞｳﾗｼ"]
["082317","茨城県","桜川市","ｲﾊﾞﾗｷｹﾝ","ｻｸﾗｶﾞﾜｼ"]
["082325","茨城県","神栖市","ｲﾊﾞﾗｷｹﾝ","ｶﾐｽｼ"]
["082333","茨城県","行方市","ｲﾊﾞﾗｷｹﾝ","ﾅﾒｶﾞﾀｼ"]
["082341","茨城県","鉾田市","ｲﾊﾞﾗｷｹﾝ","ﾎｺﾀｼ"]
["082350","茨城県","つくばみらい市","ｲﾊﾞﾗｷｹﾝ","ﾂｸﾊﾞﾐﾗｲｼ"]
["082368","茨城県","小美玉市","ｲﾊﾞﾗｷｹﾝ","ｵﾐﾀﾏｼ"]
["083020","茨城県","茨城町","ｲﾊﾞﾗｷｹﾝ","ｲﾊﾞﾗｷﾏﾁ"]
["083097","茨城県","大洗町","ｲﾊﾞﾗｷｹﾝ","ｵｵｱﾗｲﾏﾁ"]
["083101","茨城県","城里町","ｲﾊﾞﾗｷｹﾝ","ｼﾛｻﾄﾏﾁ"]
["083411","茨城県","東海村","ｲﾊﾞﾗｷｹﾝ","ﾄｳｶｲﾑﾗ"]
["083640","茨城県","大子町","ｲﾊﾞﾗｷｹﾝ","ﾀﾞｲｺﾞﾏﾁ"]
["084425","茨城県","美浦村","ｲﾊﾞﾗｷｹﾝ","ﾐﾎﾑﾗ"]
["084433","茨城県","阿見町","ｲﾊﾞﾗｷｹﾝ","ｱﾐﾏﾁ"]
["084476","茨城県","河内町","ｲﾊﾞﾗｷｹﾝ","ｶﾜﾁﾏﾁ"]
["085219","茨城県","八千代町","ｲﾊﾞﾗｷｹﾝ","ﾔﾁﾖﾏﾁ"]
["085421","茨城県","五霞町","ｲﾊﾞﾗｷｹﾝ","ｺﾞｶﾏﾁ"]
["085464","茨城県","境町","ｲﾊﾞﾗｷｹﾝ","ｻｶｲﾏﾁ"]
["085642","茨城県","利根町","ｲﾊﾞﾗｷｹﾝ","ﾄﾈﾏﾁ"]
["090000","栃木県",null,"ﾄﾁｷﾞｹﾝ"]
["092011","栃木県","宇都宮市","ﾄﾁｷﾞｹﾝ","ｳﾂﾉﾐﾔｼ"]
["092029","栃木県","足利市","ﾄﾁｷﾞｹﾝ","ｱｼｶｶﾞｼ"]
["092037","栃木県","栃木市","ﾄﾁｷﾞｹﾝ","ﾄﾁｷﾞｼ"]
["092045","栃木県","佐野市","ﾄﾁｷﾞｹﾝ","ｻﾉｼ"]
["092053","栃木県","鹿沼市","ﾄﾁｷﾞｹﾝ","ｶﾇﾏｼ"]
["092061","栃木県","日光市","ﾄﾁｷﾞｹﾝ","ﾆｯｺｳｼ"]
["092088","栃木県","小山市","ﾄﾁｷﾞｹﾝ","ｵﾔﾏｼ"]
["092096","栃木県","真岡市","ﾄﾁｷﾞｹﾝ","ﾓｵｶｼ"]
["092100","栃木県","大田原市","ﾄﾁｷﾞｹﾝ","ｵｵﾀﾜﾗｼ"]
["092118","栃木県","矢板市","ﾄﾁｷﾞｹﾝ","ﾔｲﾀｼ"]
["092134","栃木県","那須塩原市","ﾄﾁｷﾞｹﾝ","ﾅｽｼｵﾊﾞﾗｼ"]
["092142","栃木県","さくら市","ﾄﾁｷﾞｹﾝ","ｻｸﾗｼ"]
["092151","栃木県","那須烏山市","ﾄﾁｷﾞｹﾝ","ﾅｽｶﾗｽﾔﾏｼ"]
["092169","栃木県","下野市","ﾄﾁｷﾞｹﾝ","ｼﾓﾂｹｼ"]
["093017","栃木県","上三川町","ﾄﾁｷﾞｹﾝ","ｶﾐﾉｶﾜﾏﾁ"]
["093424","栃木県","益子町","ﾄﾁｷﾞｹﾝ","ﾏｼｺﾏﾁ"]
["093432","栃木県","茂木町","ﾄﾁｷﾞｹﾝ","ﾓﾃｷﾞﾏﾁ"]
["093441","栃木県","市貝町","ﾄﾁｷﾞｹﾝ","ｲﾁｶｲﾏﾁ"]
["093459","栃木県","芳賀町","ﾄﾁｷﾞｹﾝ","ﾊｶﾞﾏﾁ"]
["093611","栃木県","壬生町","ﾄﾁｷﾞｹﾝ","ﾐﾌﾞﾏﾁ"]
["093645","栃木県","野木町","ﾄﾁｷﾞｹﾝ","ﾉｷﾞﾏﾁ"]
["093840","栃木県","塩谷町","ﾄﾁｷﾞｹﾝ","ｼｵﾔﾏﾁ"]
["093866","栃木県","高根沢町","ﾄﾁｷﾞｹﾝ","ﾀｶﾈｻﾞﾜﾏﾁ"]
["094072","栃木県","那須町","ﾄﾁｷﾞｹﾝ","ﾅｽﾏﾁ"]
["094111","栃木県","那珂川町","ﾄﾁｷﾞｹﾝ","ﾅｶｶﾞﾜﾏﾁ"]
["100005","群馬県",null,"ｸﾞﾝﾏｹﾝ"]
["102016","群馬県","前橋市","ｸﾞﾝﾏｹﾝ","ﾏｴﾊﾞｼｼ"]
["102024","群馬県","高崎市","ｸﾞﾝﾏｹﾝ","ﾀｶｻｷｼ"]
["102032","群馬県","桐生市","ｸﾞﾝﾏｹﾝ","ｷﾘｭｳｼ"]
["102041","群馬県","伊勢崎市","ｸﾞﾝﾏｹﾝ","ｲｾｻｷｼ"]
["102059","群馬県","太田市","ｸﾞﾝﾏｹﾝ","ｵｵﾀｼ"]
["102067","群馬県","沼田市","ｸﾞﾝﾏｹﾝ","ﾇﾏﾀｼ"]
["102075","群馬県","館林市","ｸﾞﾝﾏｹﾝ","ﾀﾃﾊﾞﾔｼｼ"]
["102083","群馬県","渋川市","ｸﾞﾝﾏｹﾝ","ｼﾌﾞｶﾜｼ"]
["102091","群馬県","藤岡市","ｸﾞﾝﾏｹﾝ","ﾌｼﾞｵｶｼ"]
["102105","群馬県","富岡市","ｸﾞﾝﾏｹﾝ","ﾄﾐｵｶｼ"]
["102113","群馬県","安中市","ｸﾞﾝﾏｹﾝ","ｱﾝﾅｶｼ"]
["102121","群馬県","みどり市","ｸﾞﾝﾏｹﾝ","ﾐﾄﾞﾘｼ"]
["103446","群馬県","榛東村","ｸﾞﾝﾏｹﾝ","ｼﾝﾄｳﾑﾗ"]
["103454","群馬県","吉岡町","ｸﾞﾝﾏｹﾝ","ﾖｼｵｶﾏﾁ"]
["103667","群馬県","上野村","ｸﾞﾝﾏｹﾝ","ｳｴﾉﾑﾗ"]
["103675","群馬県","神流町","ｸﾞﾝﾏｹﾝ","ｶﾝﾅﾏﾁ"]
["103829","群馬県","下仁田町","ｸﾞﾝﾏｹﾝ","ｼﾓﾆﾀﾏﾁ"]
["103837","群馬県","南牧村","ｸﾞﾝﾏｹﾝ","ﾅﾝﾓｸﾑﾗ"]
["103845","群馬県","甘楽町","ｸﾞﾝﾏｹﾝ","ｶﾝﾗﾏﾁ"]
["104213","群馬県","中之条町","ｸﾞﾝﾏｹﾝ","ﾅｶﾉｼﾞﾖｳﾏﾁ"]
["104248","群馬県","長野原町","ｸﾞﾝﾏｹﾝ","ﾅｶﾞﾉﾊﾗﾏﾁ"]
["104256","群馬県","嬬恋村","ｸﾞﾝﾏｹﾝ","ﾂﾏｺﾞｲﾑﾗ"]
["104264","群馬県","草津町","ｸﾞﾝﾏｹﾝ","ｸｻﾂﾏﾁ"]
["104281","群馬県","高山村","ｸﾞﾝﾏｹﾝ","ﾀｶﾔﾏﾑﾗ"]
["104299","群馬県","東吾妻町","ｸﾞﾝﾏｹﾝ","ﾋｶﾞｼｱｶﾞﾂﾏﾏﾁ"]
["104434","群馬県","片品村","ｸﾞﾝﾏｹﾝ","ｶﾀｼﾅﾑﾗ"]
["104442","群馬県","川場村","ｸﾞﾝﾏｹﾝ","ｶﾜﾊﾞﾑﾗ"]
["104485","群馬県","昭和村","ｸﾞﾝﾏｹﾝ","ｼｮｳﾜﾑﾗ"]
["104493","群馬県","みなかみ町","ｸﾞﾝﾏｹﾝ","ﾐﾅｶﾐﾏﾁ"]
["104647","群馬県","玉村町","ｸﾞﾝﾏｹﾝ","ﾀﾏﾑﾗﾏﾁ"]
["105210","群馬県","板倉町","ｸﾞﾝﾏｹﾝ","ｲﾀｸﾗﾏﾁ"]
["105228","群馬県","明和町","ｸﾞﾝﾏｹﾝ","ﾒｲﾜﾏﾁ"]
["105236","群馬県","千代田町","ｸﾞﾝﾏｹﾝ","ﾁﾖﾀﾞﾏﾁ"]
["105244","群馬県","大泉町","ｸﾞﾝﾏｹﾝ","ｵｵｲｽﾞﾐﾏﾁ"]
["105252","群馬県","邑楽町","ｸﾞﾝﾏｹﾝ","ｵｳﾗﾏﾁ"]
["110001","埼玉県",null,"ｻｲﾀﾏｹﾝ"]
["111007","埼玉県","さいたま市","ｻｲﾀﾏｹﾝ","ｻｲﾀﾏｼ"]
["112011","埼玉県","川越市","ｻｲﾀﾏｹﾝ","ｶﾜｺﾞｴｼ"]
["112020","埼玉県","熊谷市","ｻｲﾀﾏｹﾝ","ｸﾏｶﾞﾔｼ"]
["112038","埼玉県","川口市","ｻｲﾀﾏｹﾝ","ｶﾜｸﾞﾁｼ"]
["112062","埼玉県","行田市","ｻｲﾀﾏｹﾝ","ｷﾞﾖｳﾀﾞｼ"]
["112071","埼玉県","秩父市","ｻｲﾀﾏｹﾝ","ﾁﾁﾌﾞｼ"]
["112089","埼玉県","所沢市","ｻｲﾀﾏｹﾝ","ﾄｺﾛｻﾞﾜｼ"]
["112097","埼玉県","飯能市","ｻｲﾀﾏｹﾝ","ﾊﾝﾉｳｼ"]
["112101","埼玉県","加須市","ｻｲﾀﾏｹﾝ","ｶｿﾞｼ"]
["112119","埼玉県","本庄市","ｻｲﾀﾏｹﾝ","ﾎﾝｼﾞﾖｳｼ"]
["112127","埼玉県","東松山市","ｻｲﾀﾏｹﾝ","ﾋｶﾞｼﾏﾂﾔﾏｼ"]
["112143","埼玉県","春日部市","ｻｲﾀﾏｹﾝ","ｶｽｶﾍﾞｼ"]
["112151","埼玉県","狭山市","ｻｲﾀﾏｹﾝ","ｻﾔﾏｼ"]
["112160","埼玉県","羽生市","ｻｲﾀﾏｹﾝ","ﾊﾆﾕｳｼ"]
["112178","埼玉県","鴻巣市","ｻｲﾀﾏｹﾝ","ｺｳﾉｽｼ"]
["112186","埼玉県","深谷市","ｻｲﾀﾏｹﾝ","ﾌｶﾔｼ"]
["112194","埼玉県","上尾市","ｻｲﾀﾏｹﾝ","ｱｹﾞｵｼ"]
["112216","埼玉県","草加市","ｻｲﾀﾏｹﾝ","ｿｳｶｼ"]
["112224","埼玉県","越谷市","ｻｲﾀﾏｹﾝ","ｺｼｶﾞﾔｼ"]
["112232","埼玉県","蕨市","ｻｲﾀﾏｹﾝ","ﾜﾗﾋﾞｼ"]
["112241","埼玉県","戸田市","ｻｲﾀﾏｹﾝ","ﾄﾀﾞｼ"]
["112259","埼玉県","入間市","ｻｲﾀﾏｹﾝ","ｲﾙﾏｼ"]
["112275","埼玉県","朝霞市","ｻｲﾀﾏｹﾝ","ｱｻｶｼ"]
["112283","埼玉県","志木市","ｻｲﾀﾏｹﾝ","ｼｷｼ"]
["112291","埼玉県","和光市","ｻｲﾀﾏｹﾝ","ﾜｺｳｼ"]
["112305","埼玉県","新座市","ｻｲﾀﾏｹﾝ","ﾆｲｻﾞｼ"]
["112313","埼玉県","桶川市","ｻｲﾀﾏｹﾝ","ｵｹｶﾞﾜｼ"]
["112321","埼玉県","久喜市","ｻｲﾀﾏｹﾝ","ｸｷｼ"]
["112330","埼玉県","北本市","ｻｲﾀﾏｹﾝ","ｷﾀﾓﾄｼ"]
["112348","埼玉県","八潮市","ｻｲﾀﾏｹﾝ","ﾔｼｵｼ"]
["112356","埼玉県","富士見市","ｻｲﾀﾏｹﾝ","ﾌｼﾞﾐｼ"]
["112372","埼玉県","三郷市","ｻｲﾀﾏｹﾝ","ﾐｻﾄｼ"]
["112381","埼玉県","蓮田市","ｻｲﾀﾏｹﾝ","ﾊｽﾀﾞｼ"]
["112399","埼玉県","坂戸市","ｻｲﾀﾏｹﾝ","ｻｶﾄﾞｼ"]
["112402","埼玉県","幸手市","ｻｲﾀﾏｹﾝ","ｻｯﾃｼ"]
["112411","埼玉県","鶴ヶ島市","ｻｲﾀﾏｹﾝ","ﾂﾙｶﾞｼﾏｼ"]
["112429","埼玉県","日高市","ｻｲﾀﾏｹﾝ","ﾋﾀﾞｶｼ"]
["112437","埼玉県","吉川市","ｻｲﾀﾏｹﾝ","ﾖｼｶﾜｼ"]
["112453","埼玉県","ふじみ野市","ｻｲﾀﾏｹﾝ","ﾌｼﾞﾐﾉｼ"]
["112461","埼玉県","白岡市","ｻｲﾀﾏｹﾝ","ｼﾗｵｶｼ"]
["113018","埼玉県","伊奈町","ｻｲﾀﾏｹﾝ","ｲﾅﾏﾁ"]
["113247","埼玉県","三芳町","ｻｲﾀﾏｹﾝ","ﾐﾖｼﾏﾁ"]
["113263","埼玉県","毛呂山町","ｻｲﾀﾏｹﾝ","ﾓﾛﾔﾏﾏﾁ"]
["113271","埼玉県","越生町","ｻｲﾀﾏｹﾝ","ｵｺﾞｾﾏﾁ"]
["113417","埼玉県","滑川町","ｻｲﾀﾏｹﾝ","ﾅﾒｶﾞﾜﾏﾁ"]
["113425","埼玉県","嵐山町","ｻｲﾀﾏｹﾝ","ﾗﾝｻﾞﾝﾏﾁ"]
["113433","埼玉県","小川町","ｻｲﾀﾏｹﾝ","ｵｶﾞﾜﾏﾁ"]
["113468","埼玉県","川島町","ｻｲﾀﾏｹﾝ","ｶﾜｼﾞﾏﾏﾁ"]
["113476","埼玉県","吉見町","ｻｲﾀﾏｹﾝ","ﾖｼﾐﾏﾁ"]
["113484","埼玉県","鳩山町","ｻｲﾀﾏｹﾝ","ﾊﾄﾔﾏﾏﾁ"]
["113492","埼玉県","ときがわ町","ｻｲﾀﾏｹﾝ","ﾄｷｶﾞﾜﾏﾁ"]
["113611","埼玉県","横瀬町","ｻｲﾀﾏｹﾝ","ﾖｺｾﾞﾏﾁ"]
["113620","埼玉県","皆野町","ｻｲﾀﾏｹﾝ","ﾐﾅﾉﾏﾁ"]
["113638","埼玉県","長瀞町","ｻｲﾀﾏｹﾝ","ﾅｶﾞﾄﾛﾏﾁ"]
["113654","埼玉県","小鹿野町","ｻｲﾀﾏｹﾝ","ｵｶﾞﾉﾏﾁ"]
["113697","埼玉県","東秩父村","ｻｲﾀﾏｹﾝ","ﾋｶﾞｼﾁﾁﾌﾞﾑﾗ"]
["113816","埼玉県","美里町","ｻｲﾀﾏｹﾝ","ﾐｻﾄﾏﾁ"]
["113832","埼玉県","神川町","ｻｲﾀﾏｹﾝ","ｶﾐｶﾜﾏﾁ"]
["113859","埼玉県","上里町","ｻｲﾀﾏｹﾝ","ｶﾐｻﾄﾏﾁ"]
["114081","埼玉県","寄居町","ｻｲﾀﾏｹﾝ","ﾖﾘｲﾏﾁ"]
["114421","埼玉県","宮代町","ｻｲﾀﾏｹﾝ","ﾐﾔｼﾛﾏﾁ"]
["114642","埼玉県","杉戸町","ｻｲﾀﾏｹﾝ","ｽｷﾞﾄﾏﾁ"]
["114651","埼玉県","松伏町","ｻｲﾀﾏｹﾝ","ﾏﾂﾌﾞｼﾏﾁ"]
["120006","千葉県",null,"ﾁﾊﾞｹﾝ"]
["121002","千葉県","千葉市","ﾁﾊﾞｹﾝ","ﾁﾊﾞｼ"]
["122025","千葉県","銚子市","ﾁﾊﾞｹﾝ","ﾁｮｳｼｼ"]
["122033","千葉県","市川市","ﾁﾊﾞｹﾝ","ｲﾁｶﾜｼ"]
["122041","千葉県","船橋市","ﾁﾊﾞｹﾝ","ﾌﾅﾊﾞｼｼ"]
["122050","千葉県","館山市","ﾁﾊﾞｹﾝ","ﾀﾃﾔﾏｼ"]
["122068","千葉県","木更津市","ﾁﾊﾞｹﾝ","ｷｻﾗﾂﾞｼ"]
["122076","千葉県","松戸市","ﾁﾊﾞｹﾝ","ﾏﾂﾄﾞｼ"]
["122084","千葉県","野田市","ﾁﾊﾞｹﾝ","ﾉﾀﾞｼ"]
["122106","千葉県","茂原市","ﾁﾊﾞｹﾝ","ﾓﾊﾞﾗｼ"]
["122114","千葉県","成田市","ﾁﾊﾞｹﾝ","ﾅﾘﾀｼ"]
["122122","千葉県","佐倉市","ﾁﾊﾞｹﾝ","ｻｸﾗｼ"]
["122131","千葉県","東金市","ﾁﾊﾞｹﾝ","ﾄｳｶﾞﾈｼ"]
["122157","千葉県","旭市","ﾁﾊﾞｹﾝ","ｱｻﾋｼ"]
["122165","千葉県","習志野市","ﾁﾊﾞｹﾝ","ﾅﾗｼﾉｼ"]
["122173","千葉県","柏市","ﾁﾊﾞｹﾝ","ｶｼﾜｼ"]
["122181","千葉県","勝浦市","ﾁﾊﾞｹﾝ","ｶﾂｳﾗｼ"]
["122190","千葉県","市原市","ﾁﾊﾞｹﾝ","ｲﾁﾊﾗｼ"]
["122203","千葉県","流山市","ﾁﾊﾞｹﾝ","ﾅｶﾞﾚﾔﾏｼ"]
["122211","千葉県","八千代市","ﾁﾊﾞｹﾝ","ﾔﾁﾖｼ"]
["122220","千葉県","我孫子市","ﾁﾊﾞｹﾝ","ｱﾋﾞｺｼ"]
["122238","千葉県","鴨川市","ﾁﾊﾞｹﾝ","ｶﾓｶﾞﾜｼ"]
["122246","千葉県","鎌ケ谷市","ﾁﾊﾞｹﾝ","ｶﾏｶﾞﾔｼ"]
["122254","千葉県","君津市","ﾁﾊﾞｹﾝ","ｷﾐﾂｼ"]
["122262","千葉県","富津市","ﾁﾊﾞｹﾝ","ﾌｯﾂｼ"]
["122271","千葉県","浦安市","ﾁﾊﾞｹﾝ","ｳﾗﾔｽｼ"]
["122289","千葉県","四街道市","ﾁﾊﾞｹﾝ","ﾖﾂｶｲﾄﾞｳｼ"]
["122297","千葉県","袖ケ浦市","ﾁﾊﾞｹﾝ","ｿﾃﾞｶﾞｳﾗｼ"]
["122301","千葉県","八街市","ﾁﾊﾞｹﾝ","ﾔﾁﾏﾀｼ"]
["122319","千葉県","印西市","ﾁﾊﾞｹﾝ","ｲﾝｻﾞｲｼ"]
["122327","千葉県","白井市","ﾁﾊﾞｹﾝ","ｼﾛｲｼ"]
["122335","千葉県","富里市","ﾁﾊﾞｹﾝ","ﾄﾐｻﾄｼ"]
["122343","千葉県","南房総市","ﾁﾊﾞｹﾝ","ﾐﾅﾐﾎﾞｳｿｳｼ"]
["122351","千葉県","匝瑳市","ﾁﾊﾞｹﾝ","ｿｳｻｼ"]
["122360","千葉県","香取市","ﾁﾊﾞｹﾝ","ｶﾄﾘｼ"]
["122378","千葉県","山武市","ﾁﾊﾞｹﾝ","ｻﾝﾑｼ"]
["122386","千葉県","いすみ市","ﾁﾊﾞｹﾝ","ｲｽﾐｼ"]
["122394","千葉県","大網白里市","ﾁﾊﾞｹﾝ","ｵｵｱﾐｼﾗｻﾄｼ"]
["123226","千葉県","酒々井町","ﾁﾊﾞｹﾝ","ｼｽｲﾏﾁ"]
["123293","千葉県","栄町","ﾁﾊﾞｹﾝ","ｻｶｴﾏﾁ"]
["123421","千葉県","神崎町","ﾁﾊﾞｹﾝ","ｺｳｻﾞｷﾏﾁ"]
["123471","千葉県","多古町","ﾁﾊﾞｹﾝ","ﾀｺﾏﾁ"]
["123498","千葉県","東庄町","ﾁﾊﾞｹﾝ","ﾄｳﾉｼｮｳﾏﾁ"]
["124036","千葉県","九十九里町","ﾁﾊﾞｹﾝ","ｸｼﾞﾕｳｸﾘﾏﾁ"]
["124095","千葉県","芝山町","ﾁﾊﾞｹﾝ","ｼﾊﾞﾔﾏﾏﾁ"]
["124109","千葉県","横芝光町","ﾁﾊﾞｹﾝ","ﾖｺｼﾊﾞﾋｶﾘﾏﾁ"]
["124214","千葉県","一宮町","ﾁﾊﾞｹﾝ","ｲﾁﾉﾐﾔﾏﾁ"]
["124222","千葉県","睦沢町","ﾁﾊﾞｹﾝ","ﾑﾂｻﾞﾜﾏﾁ"]
["124231","千葉県","長生村","ﾁﾊﾞｹﾝ","ﾁｮｳｾｲﾑﾗ"]
["124249","千葉県","白子町","ﾁﾊﾞｹﾝ","ｼﾗｺﾏﾁ"]
["124265","千葉県","長柄町","ﾁﾊﾞｹﾝ","ﾅｶﾞﾗﾏﾁ"]
["124273","千葉県","長南町","ﾁﾊﾞｹﾝ","ﾁｮｳﾅﾝﾏﾁ"]
["124419","千葉県","大多喜町","ﾁﾊﾞｹﾝ","ｵｵﾀｷﾏﾁ"]
["124435","千葉県","御宿町","ﾁﾊﾞｹﾝ","ｵﾝｼﾞﾕｸﾏﾁ"]
["124630","千葉県","鋸南町","ﾁﾊﾞｹﾝ","ｷﾖﾅﾝﾏﾁ"]
["130001","東京都",null,"ﾄｳｷｮｳﾄ"]
["131016","東京都","千代田区","ﾄｳｷｮｳﾄ","ﾁﾖﾀﾞｸ"]
["131024","東京都","中央区","ﾄｳｷｮｳﾄ","ﾁｭｳｵｳｸ"]
["131032","東京都","港区","ﾄｳｷｮｳﾄ","ﾐﾅﾄｸ"]
["131041","東京都","新宿区","ﾄｳｷｮｳﾄ","ｼﾝｼﾞｭｸｸ"]
["131059","東京都","文京区","ﾄｳｷｮｳﾄ","ﾌﾞﾝｷｮｳｸ"]
["131067","東京都","台東区","ﾄｳｷｮｳﾄ","ﾀｲﾄｳｸ"]
["131075","東京都","墨田区","ﾄｳｷｮｳﾄ","ｽﾐﾀﾞｸ"]
["131083","東京都","江東区","ﾄｳｷｮｳﾄ","ｺｳﾄｳｸ"]
["131091","東京都","品川区","ﾄｳｷｮｳﾄ","ｼﾅｶﾞﾜｸ"]
["131105","東京都","目黒区","ﾄｳｷｮｳﾄ","ﾒｸﾞﾛｸ"]
["131113","東京都","大田区","ﾄｳｷｮｳﾄ","ｵｵﾀｸ"]
["131121","東京都","世田谷区","ﾄｳｷｮｳﾄ","ｾﾀｶﾞﾔｸ"]
["131130","東京都","渋谷区","ﾄｳｷｮｳﾄ","ｼﾌﾞﾔｸ"]
["131148","東京都","中野区","ﾄｳｷｮｳﾄ","ﾅｶﾉｸ"]
["131156","東京都","杉並区","ﾄｳｷｮｳﾄ","ｽｷﾞﾅﾐｸ"]
["131164","東京都","豊島区","ﾄｳｷｮｳﾄ","ﾄｼﾏｸ"]
["131172","東京都","北区","ﾄｳｷｮｳﾄ","ｷﾀｸ"]
["131181","東京都","荒川区","ﾄｳｷｮｳﾄ","ｱﾗｶﾜｸ"]
["131199","東京都","板橋区","ﾄｳｷｮｳﾄ","ｲﾀﾊﾞｼｸ"]
["131202","東京都","練馬区","ﾄｳｷｮｳﾄ","ﾈﾘﾏｸ"]
["131211","東京都","足立区","ﾄｳｷｮｳﾄ","ｱﾀﾞﾁｸ"]
["131229","東京都","葛飾区","ﾄｳｷｮｳﾄ","ｶﾂｼｶｸ"]
["131237","東京都","江戸川区","ﾄｳｷｮｳﾄ","ｴﾄﾞｶﾞﾜｸ"]
["132012","東京都","八王子市","ﾄｳｷｮｳﾄ","ﾊﾁｵｳｼﾞｼ"]
["132021","東京都","立川市","ﾄｳｷｮｳﾄ","ﾀﾁｶﾜｼ"]
["132039","東京都","武蔵野市","ﾄｳｷｮｳﾄ","ﾑｻｼﾉｼ"]
["132047","東京都","三鷹市","ﾄｳｷｮｳﾄ","ﾐﾀｶｼ"]
["132055","東京都","青梅市","ﾄｳｷｮｳﾄ","ｵｳﾒｼ"]
["132063","東京都","府中市","ﾄｳｷｮｳﾄ","ﾌﾁｭｳｼ"]
["132071","東京都","昭島市","ﾄｳｷｮｳﾄ","ｱｷｼﾏｼ"]
["132080","東京都","調布市","ﾄｳｷｮｳﾄ","ﾁｮｳﾌｼ"]
["132098","東京都","町田市","ﾄｳｷｮｳﾄ","ﾏﾁﾀﾞｼ"]
["132101","東京都","小金井市","ﾄｳｷｮｳﾄ","ｺｶﾞﾈｲｼ"]
["132110","東京都","小平市","ﾄｳｷｮｳﾄ","ｺﾀﾞｲﾗｼ"]
["132128","東京都","日野市","ﾄｳｷｮｳﾄ","ﾋﾉｼ"]
["132136","東京都","東村山市","ﾄｳｷｮｳﾄ","ﾋｶﾞｼﾑﾗﾔﾏｼ"]
["132144","東京都","国分寺市","ﾄｳｷｮｳﾄ","ｺｸﾌﾞﾝｼﾞｼ"]
["132152","東京都","国立市","ﾄｳｷｮｳﾄ","ｸﾆﾀﾁｼ"]
["132187","東京都","福生市","ﾄｳｷｮｳﾄ","ﾌｯｻｼ"]
["132195","東京都","狛江市","ﾄｳｷｮｳﾄ","ｺﾏｴｼ"]
["132209","東京都","東大和市","ﾄｳｷｮｳﾄ","ﾋｶﾞｼﾔﾏﾄｼ"]
["132217","東京都","清瀬市","ﾄｳｷｮｳﾄ","ｷﾖｾｼ"]
["132225","東京都","東久留米市","ﾄｳｷｮｳﾄ","ﾋｶﾞｼｸﾙﾒｼ"]
["132233","東京都","武蔵村山市","ﾄｳｷｮｳﾄ","ﾑｻｼﾑﾗﾔﾏｼ"]
["132241","東京都","多摩市","ﾄｳｷｮｳﾄ","ﾀﾏｼ"]
["132250","東京都","稲城市","ﾄｳｷｮｳﾄ","ｲﾅｷﾞｼ"]
["132276","東京都","羽村市","ﾄｳｷｮｳﾄ","ﾊﾑﾗｼ"]
["132284","東京都","あきる野市","ﾄｳｷｮｳﾄ","ｱｷﾙﾉｼ"]
["132292","東京都","西東京市","ﾄｳｷｮｳﾄ","ﾆｼﾄｳｷｮｳｼ"]
["133035","東京都","瑞穂町","ﾄｳｷｮｳﾄ","ﾐｽﾞﾎﾏﾁ"]
["133051","東京都","日の出町","ﾄｳｷｮｳﾄ","ﾋﾉﾃﾞﾏﾁ"]
["133078","東京都","檜原村","ﾄｳｷｮｳﾄ","ﾋﾉﾊﾗﾑﾗ"]
["133086","東京都","奥多摩町","ﾄｳｷｮｳﾄ","ｵｸﾀﾏﾏﾁ"]
["133612","東京都","大島町","ﾄｳｷｮｳﾄ","ｵｵｼﾏﾏﾁ"]
["133621","東京都","利島村","ﾄｳｷｮｳﾄ","ﾄｼﾏﾑﾗ"]
["133639","東京都","新島村","ﾄｳｷｮｳﾄ","ﾆｲｼﾞﾏﾑﾗ"]
["133647","東京都","神津島村","ﾄｳｷｮｳﾄ","ｺｳﾂﾞｼﾏﾑﾗ"]
["133817","東京都","三宅村","ﾄｳｷｮｳﾄ","ﾐﾔｹﾑﾗ"]
["133825","東京都","御蔵島村","ﾄｳｷｮｳﾄ","ﾐｸﾗｼﾞﾏﾑﾗ"]
["134015","東京都","八丈町","ﾄｳｷｮｳﾄ","ﾊﾁｼﾞｮｳﾏﾁ"]
["134023","東京都","青ヶ島村","ﾄｳｷｮｳﾄ","ｱｵｶﾞｼﾏﾑﾗ"]
["134210","東京都","小笠原村","ﾄｳｷｮｳﾄ","ｵｶﾞｻﾜﾗﾑﾗ"]
["140007","神奈川県",null,"ｶﾅｶﾞﾜｹﾝ"]
["141003","神奈川県","横浜市","ｶﾅｶﾞﾜｹﾝ","ﾖｺﾊﾏｼ"]
["141305","神奈川県","川崎市","ｶﾅｶﾞﾜｹﾝ","ｶﾜｻｷｼ"]
["141500","神奈川県","相模原市","ｶﾅｶﾞﾜｹﾝ","ｻｶﾞﾐﾊﾗｼ"]
["142018","神奈川県","横須賀市","ｶﾅｶﾞﾜｹﾝ","ﾖｺｽｶｼ"]
["142034","神奈川県","平塚市","ｶﾅｶﾞﾜｹﾝ","ﾋﾗﾂｶｼ"]
["142042","神奈川県","鎌倉市","ｶﾅｶﾞﾜｹﾝ","ｶﾏｸﾗｼ"]
["142051","神奈川県","藤沢市","ｶﾅｶﾞﾜｹﾝ","ﾌｼﾞｻﾜｼ"]
["142069","神奈川県","小田原市","ｶﾅｶﾞﾜｹﾝ","ｵﾀﾞﾜﾗｼ"]
["142077","神奈川県","茅ヶ崎市","ｶﾅｶﾞﾜｹﾝ","ﾁｶﾞｻｷｼ"]
["142085","神奈川県","逗子市","ｶﾅｶﾞﾜｹﾝ","ｽﾞｼｼ"]
["142107","神奈川県","三浦市","ｶﾅｶﾞﾜｹﾝ","ﾐｳﾗｼ"]
["142115","神奈川県","秦野市","ｶﾅｶﾞﾜｹﾝ","ﾊﾀﾞﾉｼ"]
["142123","神奈川県","厚木市","ｶﾅｶﾞﾜｹﾝ","ｱﾂｷﾞｼ"]
["142131","神奈川県","大和市","ｶﾅｶﾞﾜｹﾝ","ﾔﾏﾄｼ"]
["142140","神奈川県","伊勢原市","ｶﾅｶﾞﾜｹﾝ","ｲｾﾊﾗｼ"]
["142158","神奈川県","海老名市","ｶﾅｶﾞﾜｹﾝ","ｴﾋﾞﾅｼ"]
["142166","神奈川県","座間市","ｶﾅｶﾞﾜｹﾝ","ｻﾞﾏｼ"]
["142174","神奈川県","南足柄市","ｶﾅｶﾞﾜｹﾝ","ﾐﾅﾐｱｼｶﾞﾗｼ"]
["142182","神奈川県","綾瀬市","ｶﾅｶﾞﾜｹﾝ","ｱﾔｾｼ"]
["143014","神奈川県","葉山町","ｶﾅｶﾞﾜｹﾝ","ﾊﾔﾏﾏﾁ"]
["143219","神奈川県","寒川町","ｶﾅｶﾞﾜｹﾝ","ｻﾑｶﾜﾏﾁ"]
["143413","神奈川県","大磯町","ｶﾅｶﾞﾜｹﾝ","ｵｵｲｿﾏﾁ"]
["143421","神奈川県","二宮町","ｶﾅｶﾞﾜｹﾝ","ﾆﾉﾐﾔﾏﾁ"]
["143618","神奈川県","中井町","ｶﾅｶﾞﾜｹﾝ","ﾅｶｲﾏﾁ"]
["143626","神奈川県","大井町","ｶﾅｶﾞﾜｹﾝ","ｵｵｲﾏﾁ"]
["143634","神奈川県","松田町","ｶﾅｶﾞﾜｹﾝ","ﾏﾂﾀﾞﾏﾁ"]
["143642","神奈川県","山北町","ｶﾅｶﾞﾜｹﾝ","ﾔﾏｷﾀﾏﾁ"]
["143669","神奈川県","開成町","ｶﾅｶﾞﾜｹﾝ","ｶｲｾｲﾏﾁ"]
["143821","神奈川県","箱根町","ｶﾅｶﾞﾜｹﾝ","ﾊｺﾈﾏﾁ"]
["143839","神奈川県","真鶴町","ｶﾅｶﾞﾜｹﾝ","ﾏﾅﾂﾞﾙﾏﾁ"]
["143847","神奈川県","湯河原町","ｶﾅｶﾞﾜｹﾝ","ﾕｶﾞﾜﾗﾏﾁ"]
["144011","神奈川県","愛川町","ｶﾅｶﾞﾜｹﾝ","ｱｲｶﾜﾏﾁ"]
["144029","神奈川県","清川村","ｶﾅｶﾞﾜｹﾝ","ｷﾖｶﾜﾑﾗ"]
["150002","新潟県",null,"ﾆｲｶﾞﾀｹﾝ"]
["151009","新潟県","新潟市","ﾆｲｶﾞﾀｹﾝ","ﾆｲｶﾞﾀｼ"]
["152021","新潟県","長岡市","ﾆｲｶﾞﾀｹﾝ","ﾅｶﾞｵｶｼ"]
["152048","新潟県","三条市","ﾆｲｶﾞﾀｹﾝ","ｻﾝｼﾞｮｳｼ"]
["152056","新潟県","柏崎市","ﾆｲｶﾞﾀｹﾝ","ｶｼﾜｻﾞｷｼ"]
["152064","新潟県","新発田市","ﾆｲｶﾞﾀｹﾝ","ｼﾊﾞﾀｼ"]
["152081","新潟県","小千谷市","ﾆｲｶﾞﾀｹﾝ","ｵﾁﾞﾔｼ"]
["152099","新潟県","加茂市","ﾆｲｶﾞﾀｹﾝ","ｶﾓｼ"]
["152102","新潟県","十日町市","ﾆｲｶﾞﾀｹﾝ","ﾄｵｶﾏﾁｼ"]
["152111","新潟県","見附市","ﾆｲｶﾞﾀｹﾝ","ﾐﾂｹｼ"]
["152129","新潟県","村上市","ﾆｲｶﾞﾀｹﾝ","ﾑﾗｶﾐｼ"]
["152137","新潟県","燕市","ﾆｲｶﾞﾀｹﾝ","ﾂﾊﾞﾒｼ"]
["152161","新潟県","糸魚川市","ﾆｲｶﾞﾀｹﾝ","ｲﾄｲｶﾞﾜｼ"]
["152170","新潟県","妙高市","ﾆｲｶﾞﾀｹﾝ","ﾐｮｳｺｳｼ"]
["152188","新潟県","五泉市","ﾆｲｶﾞﾀｹﾝ","ｺﾞｾﾝｼ"]
["152226","新潟県","上越市","ﾆｲｶﾞﾀｹﾝ","ｼﾞｮｳｴﾂｼ"]
["152234","新潟県","阿賀野市","ﾆｲｶﾞﾀｹﾝ","ｱｶﾞﾉｼ"]
["152242","新潟県","佐渡市","ﾆｲｶﾞﾀｹﾝ","ｻﾄﾞｼ"]
["152251","新潟県","魚沼市","ﾆｲｶﾞﾀｹﾝ","ｳｵﾇﾏｼ"]
["152269","新潟県","南魚沼市","ﾆｲｶﾞﾀｹﾝ","ﾐﾅﾐｳｵﾇﾏｼ"]
["152277","新潟県","胎内市","ﾆｲｶﾞﾀｹﾝ","ﾀｲﾅｲｼ"]
["153079","新潟県","聖籠町","ﾆｲｶﾞﾀｹﾝ","ｾｲﾛｳﾏﾁ"]
["153427","新潟県","弥彦村","ﾆｲｶﾞﾀｹﾝ","ﾔﾋｺﾑﾗ"]
["153613","新潟県","田上町","ﾆｲｶﾞﾀｹﾝ","ﾀｶﾞﾐﾏﾁ"]
["153851","新潟県","阿賀町","ﾆｲｶﾞﾀｹﾝ","ｱｶﾞﾏﾁ"]
["154059","新潟県","出雲崎町","ﾆｲｶﾞﾀｹﾝ","ｲｽﾞﾓｻﾞｷﾏﾁ"]
["154610","新潟県","湯沢町","ﾆｲｶﾞﾀｹﾝ","ﾕｻﾞﾜﾏﾁ"]
["154822","新潟県","津南町","ﾆｲｶﾞﾀｹﾝ","ﾂﾅﾝﾏﾁ"]
["155047","新潟県","刈羽村","ﾆｲｶﾞﾀｹﾝ","ｶﾘﾜﾑﾗ"]
["155811","新潟県","関川村","ﾆｲｶﾞﾀｹﾝ","ｾｷｶﾜﾑﾗ"]
["155861","新潟県","粟島浦村","ﾆｲｶﾞﾀｹﾝ","ｱﾜｼﾏｳﾗﾑﾗ"]
["160008","富山県",null,"ﾄﾔﾏｹﾝ"]
["162019","富山県","富山市","ﾄﾔﾏｹﾝ","ﾄﾔﾏｼ"]
["162027","富山県","高岡市","ﾄﾔﾏｹﾝ","ﾀｶｵｶｼ"]
["162043","富山県","魚津市","ﾄﾔﾏｹﾝ","ｳｵﾂﾞｼ"]
["162051","富山県","氷見市","ﾄﾔﾏｹﾝ","ﾋﾐｼ"]
["162060","富山県","滑川市","ﾄﾔﾏｹﾝ","ﾅﾒﾘｶﾜｼ"]
["162078","富山県","黒部市","ﾄﾔﾏｹﾝ","ｸﾛﾍﾞｼ"]
["162086","富山県","砺波市","ﾄﾔﾏｹﾝ","ﾄﾅﾐｼ"]
["162094","富山県","小矢部市","ﾄﾔﾏｹﾝ","ｵﾔﾍﾞｼ"]
["162108","富山県","南砺市","ﾄﾔﾏｹﾝ","ﾅﾝﾄｼ"]
["162116","富山県","射水市","ﾄﾔﾏｹﾝ","ｲﾐｽﾞｼ"]
["163210","富山県","舟橋村","ﾄﾔﾏｹﾝ","ﾌﾅﾊｼﾑﾗ"]
["163228","富山県","上市町","ﾄﾔﾏｹﾝ","ｶﾐｲﾁﾏﾁ"]
["163236","富山県","立山町","ﾄﾔﾏｹﾝ","ﾀﾃﾔﾏﾏﾁ"]
["163422","富山県","入善町","ﾄﾔﾏｹﾝ","ﾆｭｳｾﾞﾝﾏﾁ"]
["163431","富山県","朝日町","ﾄﾔﾏｹﾝ","ｱｻﾋﾏﾁ"]
["170003","石川県",null,"ｲｼｶﾜｹﾝ"]
["172014","石川県","金沢市","ｲｼｶﾜｹﾝ","ｶﾅｻﾞﾜｼ"]
["172022","石川県","七尾市","ｲｼｶﾜｹﾝ","ﾅﾅｵｼ"]
["172031","石川県","小松市","ｲｼｶﾜｹﾝ","ｺﾏﾂｼ"]
["172049","石川県","輪島市","ｲｼｶﾜｹﾝ","ﾜｼﾞﾏｼ"]
["172057","石川県","珠洲市","ｲｼｶﾜｹﾝ","ｽｽﾞｼ"]
["172065","石川県","加賀市","ｲｼｶﾜｹﾝ","ｶｶﾞｼ"]
["172073","石川県","羽咋市","ｲｼｶﾜｹﾝ","ﾊｸｲｼ"]
["172090","石川県","かほく市","ｲｼｶﾜｹﾝ","ｶﾎｸｼ"]
["172103","石川県","白山市","ｲｼｶﾜｹﾝ","ﾊｸｻﾝｼ"]
["172111","石川県","能美市","ｲｼｶﾜｹﾝ","ﾉﾐｼ"]
["172120","石川県","野々市市","ｲｼｶﾜｹﾝ","ﾉﾉｲﾁｼ"]
["173240","石川県","川北町","ｲｼｶﾜｹﾝ","ｶﾜｷﾀﾏﾁ"]
["173614","石川県","津幡町","ｲｼｶﾜｹﾝ","ﾂﾊﾞﾀﾏﾁ"]
["173657","石川県","内灘町","ｲｼｶﾜｹﾝ","ｳﾁﾅﾀﾞﾏﾁ"]
["173843","石川県","志賀町","ｲｼｶﾜｹﾝ","ｼｶﾏﾁ"]
["173860","石川県","宝達志水町","ｲｼｶﾜｹﾝ","ﾎｳﾀﾞﾂｼﾐｽﾞﾁｮｳ"]
["174076","石川県","中能登町","ｲｼｶﾜｹﾝ","ﾅｶﾉﾄﾏﾁ"]
["174611","石川県","穴水町","ｲｼｶﾜｹﾝ","ｱﾅﾐｽﾞﾏﾁ"]
["174637","石川県","能登町","ｲｼｶﾜｹﾝ","ﾉﾄﾁｮｳ"]
["180009","福井県",null,"ﾌｸｲｹﾝ"]
["182010","福井県","福井市","ﾌｸｲｹﾝ","ﾌｸｲｼ"]
["182028","福井県","敦賀市","ﾌｸｲｹﾝ","ﾂﾙｶﾞｼ"]
["182044","福井県","小浜市","ﾌｸｲｹﾝ","ｵﾊﾞﾏｼ"]
["182052","福井県","大野市","ﾌｸｲｹﾝ","ｵｵﾉｼ"]
["182061","福井県","勝山市","ﾌｸｲｹﾝ","ｶﾂﾔﾏｼ"]
["182079","福井県","鯖江市","ﾌｸｲｹﾝ","ｻﾊﾞｴｼ"]
["182087","福井県","あわら市","ﾌｸｲｹﾝ","ｱﾜﾗｼ"]
["182095","福井県","越前市","ﾌｸｲｹﾝ","ｴﾁｾﾞﾝｼ"]
["182109","福井県","坂井市","ﾌｸｲｹﾝ","ｻｶｲｼ"]
["183229","福井県","永平寺町","ﾌｸｲｹﾝ","ｴｲﾍｲｼﾞﾁｮｳ"]
["183822","福井県","池田町","ﾌｸｲｹﾝ","ｲｹﾀﾞﾁｮｳ"]
["184047","福井県","南越前町","ﾌｸｲｹﾝ","ﾐﾅﾐｴﾁｾﾞﾝﾁｮｳ"]
["184233","福井県","越前町","ﾌｸｲｹﾝ","ｴﾁｾﾞﾝﾁｮｳ"]
["184420","福井県","美浜町","ﾌｸｲｹﾝ","ﾐﾊﾏﾁｮｳ"]
["184811","福井県","高浜町","ﾌｸｲｹﾝ","ﾀｶﾊﾏﾁｮｳ"]
["184837","福井県","おおい町","ﾌｸｲｹﾝ","ｵｵｲﾁｮｳ"]
["185019","福井県","若狭町","ﾌｸｲｹﾝ","ﾜｶｻﾁｮｳ"]
["190004","山梨県",null,"ﾔﾏﾅｼｹﾝ"]
["192015","山梨県","甲府市","ﾔﾏﾅｼｹﾝ","ｺｳﾌｼ"]
["192023","山梨県","富士吉田市","ﾔﾏﾅｼｹﾝ","ﾌｼﾞﾖｼﾀﾞｼ"]
["192040","山梨県","都留市","ﾔﾏﾅｼｹﾝ","ﾂﾙｼ"]
["192058","山梨県","山梨市","ﾔﾏﾅｼｹﾝ","ﾔﾏﾅｼｼ"]
["192066","山梨県","大月市","ﾔﾏﾅｼｹﾝ","ｵｵﾂｷｼ"]
["192074","山梨県","韮崎市","ﾔﾏﾅｼｹﾝ","ﾆﾗｻｷｼ"]
["192082","山梨県","南アルプス市","ﾔﾏﾅｼｹﾝ","ﾐﾅﾐｱﾙﾌﾟｽｼ"]
["192091","山梨県","北杜市","ﾔﾏﾅｼｹﾝ","ﾎｸﾄｼ"]
["192104","山梨県","甲斐市","ﾔﾏﾅｼｹﾝ","ｶｲｼ"]
["192112","山梨県","笛吹市","ﾔﾏﾅｼｹﾝ","ﾌｴﾌｷｼ"]
["192121","山梨県","上野原市","ﾔﾏﾅｼｹﾝ","ｳｴﾉﾊﾗｼ"]
["192139","山梨県","甲州市","ﾔﾏﾅｼｹﾝ","ｺｳｼｭｳｼ"]
["192147","山梨県","中央市","ﾔﾏﾅｼｹﾝ","ﾁｭｳｵｳｼ"]
["193461","山梨県","市川三郷町","ﾔﾏﾅｼｹﾝ","ｲﾁｶﾜﾐｻﾄﾁｮｳ"]
["193640","山梨県","早川町","ﾔﾏﾅｼｹﾝ","ﾊﾔｶﾜﾁｮｳ"]
["193658","山梨県","身延町","ﾔﾏﾅｼｹﾝ","ﾐﾉﾌﾞﾁｮｳ"]
["193666","山梨県","南部町","ﾔﾏﾅｼｹﾝ","ﾅﾝﾌﾞﾁｮｳ"]
["193682","山梨県","富士川町","ﾔﾏﾅｼｹﾝ","ﾌｼﾞｶﾜﾁｮｳ"]
["193844","山梨県","昭和町","ﾔﾏﾅｼｹﾝ","ｼｮｳﾜﾁｮｳ"]
["194221","山梨県","道志村","ﾔﾏﾅｼｹﾝ","ﾄﾞｳｼﾑﾗ"]
["194239","山梨県","西桂町","ﾔﾏﾅｼｹﾝ","ﾆｼｶﾂﾗﾁｮｳ"]
["194247","山梨県","忍野村","ﾔﾏﾅｼｹﾝ","ｵｼﾉﾑﾗ"]
["194255","山梨県","山中湖村","ﾔﾏﾅｼｹﾝ","ﾔﾏﾅｶｺﾑﾗ"]
["194298","山梨県","鳴沢村","ﾔﾏﾅｼｹﾝ","ﾅﾙｻﾜﾑﾗ"]
["194301","山梨県","富士河口湖町","ﾔﾏﾅｼｹﾝ","ﾌｼﾞｶﾜｸﾞﾁｺﾏﾁ"]
["194425","山梨県","小菅村","ﾔﾏﾅｼｹﾝ","ｺｽｹﾞﾑﾗ"]
["194433","山梨県","丹波山村","ﾔﾏﾅｼｹﾝ","ﾀﾊﾞﾔﾏﾑﾗ"]
["200000","長野県",null,"ﾅｶﾞﾉｹﾝ"]
["202011","長野県","長野市","ﾅｶﾞﾉｹﾝ","ﾅｶﾞﾉｼ"]
["202029","長野県","松本市","ﾅｶﾞﾉｹﾝ","ﾏﾂﾓﾄｼ"]
["202037","長野県","上田市","ﾅｶﾞﾉｹﾝ","ｳｴﾀﾞｼ"]
["202045","長野県","岡谷市","ﾅｶﾞﾉｹﾝ","ｵｶﾔｼ"]
["202053","長野県","飯田市","ﾅｶﾞﾉｹﾝ","ｲｲﾀﾞｼ"]
["202061","長野県","諏訪市","ﾅｶﾞﾉｹﾝ","ｽﾜｼ"]
["202070","長野県","須坂市","ﾅｶﾞﾉｹﾝ","ｽｻﾞｶｼ"]
["202088","長野県","小諸市","ﾅｶﾞﾉｹﾝ","ｺﾓﾛｼ"]
["202096","長野県","伊那市","ﾅｶﾞﾉｹﾝ","ｲﾅｼ"]
["202100","長野県","駒ヶ根市","ﾅｶﾞﾉｹﾝ","ｺﾏｶﾞﾈｼ"]
["202118","長野県","中野市","ﾅｶﾞﾉｹﾝ","ﾅｶﾉｼ"]
["202126","長野県","大町市","ﾅｶﾞﾉｹﾝ","ｵｵﾏﾁｼ"]
["202134","長野県","飯山市","ﾅｶﾞﾉｹﾝ","ｲｲﾔﾏｼ"]
["202142","長野県","茅野市","ﾅｶﾞﾉｹﾝ","ﾁﾉｼ"]
["202151","長野県","塩尻市","ﾅｶﾞﾉｹﾝ","ｼｵｼﾞﾘｼ"]
["202177","長野県","佐久市","ﾅｶﾞﾉｹﾝ","ｻｸｼ"]
["202185","長野県","千曲市","ﾅｶﾞﾉｹﾝ","ﾁｸﾏｼ"]
["202193","長野県","東御市","ﾅｶﾞﾉｹﾝ","ﾄｳﾐｼ"]
["202207","長野県","安曇野市","ﾅｶﾞﾉｹﾝ","ｱﾂﾞﾐﾉｼ"]
["203033","長野県","小海町","ﾅｶﾞﾉｹﾝ","ｺｳﾐﾏﾁ"]
["203041","長野県","川上村","ﾅｶﾞﾉｹﾝ","ｶﾜｶﾐﾑﾗ"]
["203050","長野県","南牧村","ﾅｶﾞﾉｹﾝ","ﾐﾅﾐﾏｷﾑﾗ"]
["203068","長野県","南相木村","ﾅｶﾞﾉｹﾝ","ﾐﾅﾐｱｲｷﾑﾗ"]
["203076","長野県","北相木村","ﾅｶﾞﾉｹﾝ","ｷﾀｱｲｷﾑﾗ"]
["203092","長野県","佐久穂町","ﾅｶﾞﾉｹﾝ","ｻｸﾎﾏﾁ"]
["203211","長野県","軽井沢町","ﾅｶﾞﾉｹﾝ","ｶﾙｲｻﾞﾜﾏﾁ"]
["203238","長野県","御代田町","ﾅｶﾞﾉｹﾝ","ﾐﾖﾀﾏﾁ"]
["203246","長野県","立科町","ﾅｶﾞﾉｹﾝ","ﾀﾃｼﾅﾏﾁ"]
["203491","長野県","青木村","ﾅｶﾞﾉｹﾝ","ｱｵｷﾑﾗ"]
["203505","長野県","長和町","ﾅｶﾞﾉｹﾝ","ﾅｶﾞﾜﾏﾁ"]
["203611","長野県","下諏訪町","ﾅｶﾞﾉｹﾝ","ｼﾓｽﾜﾏﾁ"]
["203629","長野県","富士見町","ﾅｶﾞﾉｹﾝ","ﾌｼﾞﾐﾏﾁ"]
["203637","長野県","原村","ﾅｶﾞﾉｹﾝ","ﾊﾗﾑﾗ"]
["203823","長野県","辰野町","ﾅｶﾞﾉｹﾝ","ﾀﾂﾉﾏﾁ"]
["203831","長野県","箕輪町","ﾅｶﾞﾉｹﾝ","ﾐﾉﾜﾏﾁ"]
["203840","長野県","飯島町","ﾅｶﾞﾉｹﾝ","ｲｲｼﾞﾏﾏﾁ"]
["203858","長野県","南箕輪村","ﾅｶﾞﾉｹﾝ","ﾐﾅﾐﾐﾉﾜﾑﾗ"]
["203866","長野県","中川村","ﾅｶﾞﾉｹﾝ","ﾅｶｶﾞﾜﾑﾗ"]
["203882","長野県","宮田村","ﾅｶﾞﾉｹﾝ","ﾐﾔﾀﾞﾑﾗ"]
["204021","長野県","松川町","ﾅｶﾞﾉｹﾝ","ﾏﾂｶﾜﾏﾁ"]
["204030","長野県","高森町","ﾅｶﾞﾉｹﾝ","ﾀｶﾓﾘﾏﾁ"]
["204048","長野県","阿南町","ﾅｶﾞﾉｹﾝ","ｱﾅﾝﾁｮｳ"]
["204072","長野県","阿智村","ﾅｶﾞﾉｹﾝ","ｱﾁﾑﾗ"]
["204099","長野県","平谷村","ﾅｶﾞﾉｹﾝ","ﾋﾗﾔﾑﾗ"]
["204102","長野県","根羽村","ﾅｶﾞﾉｹﾝ","ﾈﾊﾞﾑﾗ"]
["204111","長野県","下條村","ﾅｶﾞﾉｹﾝ","ｼﾓｼﾞｮｳﾑﾗ"]
["204129","長野県","売木村","ﾅｶﾞﾉｹﾝ","ｳﾙｷﾞﾑﾗ"]
["204137","長野県","天龍村","ﾅｶﾞﾉｹﾝ","ﾃﾝﾘｭｳﾑﾗ"]
["204145","長野県","泰阜村","ﾅｶﾞﾉｹﾝ","ﾔｽｵｶﾑﾗ"]
["204153","長野県","喬木村","ﾅｶﾞﾉｹﾝ","ﾀｶｷﾞﾑﾗ"]
["204161","長野県","豊丘村","ﾅｶﾞﾉｹﾝ","ﾄﾖｵｶﾑﾗ"]
["204170","長野県","大鹿村","ﾅｶﾞﾉｹﾝ","ｵｵｼｶﾑﾗ"]
["204226","長野県","上松町","ﾅｶﾞﾉｹﾝ","ｱｹﾞﾏﾂﾏﾁ"]
["204234","長野県","南木曽町","ﾅｶﾞﾉｹﾝ","ﾅｷﾞｿﾏﾁ"]
["204251","長野県","木祖村","ﾅｶﾞﾉｹﾝ","ｷｿﾑﾗ"]
["204293","長野県","王滝村","ﾅｶﾞﾉｹﾝ","ｵｳﾀｷﾑﾗ"]
["204307","長野県","大桑村","ﾅｶﾞﾉｹﾝ","ｵｵｸﾜﾑﾗ"]
["204323","長野県","木曽町","ﾅｶﾞﾉｹﾝ","ｷｿﾏﾁ"]
["204463","長野県","麻績村","ﾅｶﾞﾉｹﾝ","ｵﾐﾑﾗ"]
["204480","長野県","生坂村","ﾅｶﾞﾉｹﾝ","ｲｸｻｶﾑﾗ"]
["204501","長野県","山形村","ﾅｶﾞﾉｹﾝ","ﾔﾏｶﾞﾀﾑﾗ"]
["204510","長野県","朝日村","ﾅｶﾞﾉｹﾝ","ｱｻﾋﾑﾗ"]
["204528","長野県","筑北村","ﾅｶﾞﾉｹﾝ","ﾁｸﾎｸﾑﾗ"]
["204811","長野県","池田町","ﾅｶﾞﾉｹﾝ","ｲｹﾀﾞﾏﾁ"]
["204820","長野県","松川村","ﾅｶﾞﾉｹﾝ","ﾏﾂｶﾜﾑﾗ"]
["204854","長野県","白馬村","ﾅｶﾞﾉｹﾝ","ﾊｸﾊﾞﾑﾗ"]
["204862","長野県","小谷村","ﾅｶﾞﾉｹﾝ","ｵﾀﾘﾑﾗ"]
["205214","長野県","坂城町","ﾅｶﾞﾉｹﾝ","ｻｶｷﾏﾁ"]
["205419","長野県","小布施町","ﾅｶﾞﾉｹﾝ","ｵﾌﾞｾﾏﾁ"]
["205435","長野県","高山村","ﾅｶﾞﾉｹﾝ","ﾀｶﾔﾏﾑﾗ"]
["205613","長野県","山ノ内町","ﾅｶﾞﾉｹﾝ","ﾔﾏﾉｳﾁﾏﾁ"]
["205621","長野県","木島平村","ﾅｶﾞﾉｹﾝ","ｷｼﾞﾏﾀﾞｲﾗﾑﾗ"]
["205630","長野県","野沢温泉村","ﾅｶﾞﾉｹﾝ","ﾉｻﾞﾜｵﾝｾﾝﾑﾗ"]
["205834","長野県","信濃町","ﾅｶﾞﾉｹﾝ","ｼﾅﾉﾏﾁ"]
["205885","長野県","小川村","ﾅｶﾞﾉｹﾝ","ｵｶﾞﾜﾑﾗ"]
["205907","長野県","飯綱町","ﾅｶﾞﾉｹﾝ","ｲｲﾂﾞﾅﾏﾁ"]
["206024","長野県","栄村","ﾅｶﾞﾉｹﾝ","ｻｶｴﾑﾗ"]
["210005","岐阜県",null,"ｷﾞﾌｹﾝ"]
["212016","岐阜県","岐阜市","ｷﾞﾌｹﾝ","ｷﾞﾌｼ"]
["212024","岐阜県","大垣市","ｷﾞﾌｹﾝ","ｵｵｶﾞｷｼ"]
["212032","岐阜県","高山市","ｷﾞﾌｹﾝ","ﾀｶﾔﾏｼ"]
["212041","岐阜県","多治見市","ｷﾞﾌｹﾝ","ﾀｼﾞﾐｼ"]
["212059","岐阜県","関市","ｷﾞﾌｹﾝ","ｾｷｼ"]
["212067","岐阜県","中津川市","ｷﾞﾌｹﾝ","ﾅｶﾂｶﾞﾜｼ"]
["212075","岐阜県","美濃市","ｷﾞﾌｹﾝ","ﾐﾉｼ"]
["212083","岐阜県","瑞浪市","ｷﾞﾌｹﾝ","ﾐｽﾞﾅﾐｼ"]
["212091","岐阜県","羽島市","ｷﾞﾌｹﾝ","ﾊｼﾏｼ"]
["212105","岐阜県","恵那市","ｷﾞﾌｹﾝ","ｴﾅｼ"]
["212113","岐阜県","美濃加茂市","ｷﾞﾌｹﾝ","ﾐﾉｶﾓｼ"]
["212121","岐阜県","土岐市","ｷﾞﾌｹﾝ","ﾄｷｼ"]
["212130","岐阜県","各務原市","ｷﾞﾌｹﾝ","ｶｶﾐｶﾞﾊﾗｼ"]
["212148","岐阜県","可児市","ｷﾞﾌｹﾝ","ｶﾆｼ"]
["212156","岐阜県","山県市","ｷﾞﾌｹﾝ","ﾔﾏｶﾞﾀｼ"]
["212164","岐阜県","瑞穂市","ｷﾞﾌｹﾝ","ﾐｽﾞﾎｼ"]
["212172","岐阜県","飛騨市","ｷﾞﾌｹﾝ","ﾋﾀﾞｼ"]
["212181","岐阜県","本巣市","ｷﾞﾌｹﾝ","ﾓﾄｽｼ"]
["212199","岐阜県","郡上市","ｷﾞﾌｹﾝ","ｸﾞｼﾞｮｳｼ"]
["212202","岐阜県","下呂市","ｷﾞﾌｹﾝ","ｹﾞﾛｼ"]
["212211","岐阜県","海津市","ｷﾞﾌｹﾝ","ｶｲﾂﾞｼ"]
["213021","岐阜県","岐南町","ｷﾞﾌｹﾝ","ｷﾞﾅﾝﾁｮｳ"]
["213039","岐阜県","笠松町","ｷﾞﾌｹﾝ","ｶｻﾏﾂﾁｮｳ"]
["213411","岐阜県","養老町","ｷﾞﾌｹﾝ","ﾖｳﾛｳﾁｮｳ"]
["213616","岐阜県","垂井町","ｷﾞﾌｹﾝ","ﾀﾙｲﾁｮｳ"]
["213624","岐阜県","関ケ原町","ｷﾞﾌｹﾝ","ｾｷｶﾞﾊﾗﾁｮｳ"]
["213811","岐阜県","神戸町","ｷﾞﾌｹﾝ","ｺﾞｳﾄﾞﾁｮｳ"]
["213829","岐阜県","輪之内町","ｷﾞﾌｹﾝ","ﾜﾉｳﾁﾁｮｳ"]
["213837","岐阜県","安八町","ｷﾞﾌｹﾝ","ｱﾝﾊﾟﾁﾁｮｳ"]
["214019","岐阜県","揖斐川町","ｷﾞﾌｹﾝ","ｲﾋﾞｶﾞﾜﾁｮｳ"]
["214035","岐阜県","大野町","ｷﾞﾌｹﾝ","ｵｵﾉﾁｮｳ"]
["214043","岐阜県","池田町","ｷﾞﾌｹﾝ","ｲｹﾀﾞﾁｮｳ"]
["214213","岐阜県","北方町","ｷﾞﾌｹﾝ","ｷﾀｶﾞﾀﾁｮｳ"]
["215015","岐阜県","坂祝町","ｷﾞﾌｹﾝ","ｻｶﾎｷﾞﾁｮｳ"]
["215023","岐阜県","富加町","ｷﾞﾌｹﾝ","ﾄﾐｶﾁｮｳ"]
["215031","岐阜県","川辺町","ｷﾞﾌｹﾝ","ｶﾜﾍﾞﾁｮｳ"]
["215040","岐阜県","七宗町","ｷﾞﾌｹﾝ","ﾋﾁｿｳﾁｮｳ"]
["215058","岐阜県","八百津町","ｷﾞﾌｹﾝ","ﾔｵﾂﾁｮｳ"]
["215066","岐阜県","白川町","ｷﾞﾌｹﾝ","ｼﾗｶﾜﾁｮｳ"]
["215074","岐阜県","東白川村","ｷﾞﾌｹﾝ","ﾋｶﾞｼｼﾗｶﾜﾑﾗ"]
["215210","岐阜県","御嵩町","ｷﾞﾌｹﾝ","ﾐﾀｹﾁｮｳ"]
["216046","岐阜県","白川村","ｷﾞﾌｹﾝ","ｼﾗｶﾜﾑﾗ"]
["220001","静岡県",null,"ｼｽﾞｵｶｹﾝ"]
["221007","静岡県","静岡市","ｼｽﾞｵｶｹﾝ","ｼｽﾞｵｶｼ"]
["221309","静岡県","浜松市","ｼｽﾞｵｶｹﾝ","ﾊﾏﾏﾂｼ"]
["222038","静岡県","沼津市","ｼｽﾞｵｶｹﾝ","ﾇﾏﾂﾞｼ"]
["222054","静岡県","熱海市","ｼｽﾞｵｶｹﾝ","ｱﾀﾐｼ"]
["222062","静岡県","三島市","ｼｽﾞｵｶｹﾝ","ﾐｼﾏｼ"]
["222071","静岡県","富士宮市","ｼｽﾞｵｶｹﾝ","ﾌｼﾞﾉﾐﾔｼ"]
["222089","静岡県","伊東市","ｼｽﾞｵｶｹﾝ","ｲﾄｳｼ"]
["222097","静岡県","島田市","ｼｽﾞｵｶｹﾝ","ｼﾏﾀﾞｼ"]
["222101","静岡県","富士市","ｼｽﾞｵｶｹﾝ","ﾌｼﾞｼ"]
["222119","静岡県","磐田市","ｼｽﾞｵｶｹﾝ","ｲﾜﾀｼ"]
["222127","静岡県","焼津市","ｼｽﾞｵｶｹﾝ","ﾔｲﾂﾞｼ"]
["222135","静岡県","掛川市","ｼｽﾞｵｶｹﾝ","ｶｹｶﾞﾜｼ"]
["222143","静岡県","藤枝市","ｼｽﾞｵｶｹﾝ","ﾌｼﾞｴﾀﾞｼ"]
["222151","静岡県","御殿場市","ｼｽﾞｵｶｹﾝ","ｺﾞﾃﾝﾊﾞｼ"]
["222160","静岡県","袋井市","ｼｽﾞｵｶｹﾝ","ﾌｸﾛｲｼ"]
["222194","静岡県","下田市","ｼｽﾞｵｶｹﾝ","ｼﾓﾀﾞｼ"]
["222208","静岡県","裾野市","ｼｽﾞｵｶｹﾝ","ｽｿﾉｼ"]
["222216","静岡県","湖西市","ｼｽﾞｵｶｹﾝ","ｺｻｲｼ"]
["222224","静岡県","伊豆市","ｼｽﾞｵｶｹﾝ","ｲｽﾞｼ"]
["222232","静岡県","御前崎市","ｼｽﾞｵｶｹﾝ","ｵﾏｴｻﾞｷｼ"]
["222241","静岡県","菊川市","ｼｽﾞｵｶｹﾝ","ｷｸｶﾞﾜｼ"]
["222259","静岡県","伊豆の国市","ｼｽﾞｵｶｹﾝ","ｲｽﾞﾉｸﾆｼ"]
["222267","静岡県","牧之原市","ｼｽﾞｵｶｹﾝ","ﾏｷﾉﾊﾗｼ"]
["223018","静岡県","東伊豆町","ｼｽﾞｵｶｹﾝ","ﾋｶﾞｼｲｽﾞﾁｮｳ"]
["223026","静岡県","河津町","ｼｽﾞｵｶｹﾝ","ｶﾜﾂﾞﾁｮｳ"]
["223042","静岡県","南伊豆町","ｼｽﾞｵｶｹﾝ","ﾐﾅﾐｲｽﾞﾁｮｳ"]
["223051","静岡県","松崎町","ｼｽﾞｵｶｹﾝ","ﾏﾂｻﾞｷﾁｮｳ"]
["223069","静岡県","西伊豆町","ｼｽﾞｵｶｹﾝ","ﾆｼｲｽﾞﾁｮｳ"]
["223255","静岡県","函南町","ｼｽﾞｵｶｹﾝ","ｶﾝﾅﾐﾁｮｳ"]
["223417","静岡県","清水町","ｼｽﾞｵｶｹﾝ","ｼﾐｽﾞﾁｮｳ"]
["223425","静岡県","長泉町","ｼｽﾞｵｶｹﾝ","ﾅｶﾞｲｽﾞﾐﾁｮｳ"]
["223441","静岡県","小山町","ｼｽﾞｵｶｹﾝ","ｵﾔﾏﾁｮｳ"]
["224243","静岡県","吉田町","ｼｽﾞｵｶｹﾝ","ﾖｼﾀﾞﾁｮｳ"]
["224294","静岡県","川根本町","ｼｽﾞｵｶｹﾝ","ｶﾜﾈﾎﾝﾁｮｳ"]
["224618","静岡県","森町","ｼｽﾞｵｶｹﾝ","ﾓﾘﾏﾁ"]
["230006","愛知県",null,"ｱｲﾁｹﾝ"]
["231002","愛知県","名古屋市","ｱｲﾁｹﾝ","ﾅｺﾞﾔｼ"]
["232017","愛知県","豊橋市","ｱｲﾁｹﾝ","ﾄﾖﾊｼｼ"]
["232025","愛知県","岡崎市","ｱｲﾁｹﾝ","ｵｶｻﾞｷｼ"]
["232033","愛知県","一宮市","ｱｲﾁｹﾝ","ｲﾁﾉﾐﾔｼ"]
["232041","愛知県","瀬戸市","ｱｲﾁｹﾝ","ｾﾄｼ"]
["232050","愛知県","半田市","ｱｲﾁｹﾝ","ﾊﾝﾀﾞｼ"]
["232068","愛知県","春日井市","ｱｲﾁｹﾝ","ｶｽｶﾞｲｼ"]
["232076","愛知県","豊川市","ｱｲﾁｹﾝ","ﾄﾖｶﾜｼ"]
["232084","愛知県","津島市","ｱｲﾁｹﾝ","ﾂｼﾏｼ"]
["232092","愛知県","碧南市","ｱｲﾁｹﾝ","ﾍｷﾅﾝｼ"]
["232106","愛知県","刈谷市","ｱｲﾁｹﾝ","ｶﾘﾔｼ"]
["232114","愛知県","豊田市","ｱｲﾁｹﾝ","ﾄﾖﾀｼ"]
["232122","愛知県","安城市","ｱｲﾁｹﾝ","ｱﾝｼﾞｮｳｼ"]
["232131","愛知県","西尾市","ｱｲﾁｹﾝ","ﾆｼｵｼ"]
["232149","愛知県","蒲郡市","ｱｲﾁｹﾝ","ｶﾞﾏｺﾞｵﾘｼ"]
["232157","愛知県","犬山市","ｱｲﾁｹﾝ","ｲﾇﾔﾏｼ"]
["232165","愛知県","常滑市","ｱｲﾁｹﾝ","ﾄｺﾅﾒｼ"]
["232173","愛知県","江南市","ｱｲﾁｹﾝ","ｺｳﾅﾝｼ"]
["232190","愛知県","小牧市","ｱｲﾁｹﾝ","ｺﾏｷｼ"]
["232203","愛知県","稲沢市","ｱｲﾁｹﾝ","ｲﾅｻﾞﾜｼ"]
["232211","愛知県","新城市","ｱｲﾁｹﾝ","ｼﾝｼﾛｼ"]
["232220","愛知県","東海市","ｱｲﾁｹﾝ","ﾄｳｶｲｼ"]
["232238","愛知県","大府市","ｱｲﾁｹﾝ","ｵｵﾌﾞｼ"]
["232246","愛知県","知多市","ｱｲﾁｹﾝ","ﾁﾀｼ"]
["232254","愛知県","知立市","ｱｲﾁｹﾝ","ﾁﾘｭｳｼ"]
["232262","愛知県","尾張旭市","ｱｲﾁｹﾝ","ｵﾜﾘｱｻﾋｼ"]
["232271","愛知県","高浜市","ｱｲﾁｹﾝ","ﾀｶﾊﾏｼ"]
["232289","愛知県","岩倉市","ｱｲﾁｹﾝ","ｲﾜｸﾗｼ"]
["232297","愛知県","豊明市","ｱｲﾁｹﾝ","ﾄﾖｱｹｼ"]
["232301","愛知県","日進市","ｱｲﾁｹﾝ","ﾆｯｼﾝｼ"]
["232319","愛知県","田原市","ｱｲﾁｹﾝ","ﾀﾊﾗｼ"]
["232327","愛知県","愛西市","ｱｲﾁｹﾝ","ｱｲｻｲｼ"]
["232335","愛知県","清須市","ｱｲﾁｹﾝ","ｷﾖｽｼ"]
["232343","愛知県","北名古屋市","ｱｲﾁｹﾝ","ｷﾀﾅｺﾞﾔｼ"]
["232351","愛知県","弥富市","ｱｲﾁｹﾝ","ﾔﾄﾐｼ"]
["232360","愛知県","みよし市","ｱｲﾁｹﾝ","ﾐﾖｼｼ"]
["232378","愛知県","あま市","ｱｲﾁｹﾝ","ｱﾏｼ"]
["232386","愛知県","長久手市","ｱｲﾁｹﾝ","ﾅｶﾞｸﾃｼ"]
["233021","愛知県","東郷町","ｱｲﾁｹﾝ","ﾄｳｺﾞｳﾁｮｳ"]
["233421","愛知県","豊山町","ｱｲﾁｹﾝ","ﾄﾖﾔﾏﾁｮｳ"]
["233617","愛知県","大口町","ｱｲﾁｹﾝ","ｵｵｸﾞﾁﾁｮｳ"]
["233625","愛知県","扶桑町","ｱｲﾁｹﾝ","ﾌｿｳﾁｮｳ"]
["234249","愛知県","大治町","ｱｲﾁｹﾝ","ｵｵﾊﾙﾁｮｳ"]
["234257","愛知県","蟹江町","ｱｲﾁｹﾝ","ｶﾆｴﾁｮｳ"]
["234273","愛知県","飛島村","ｱｲﾁｹﾝ","ﾄﾋﾞｼﾏﾑﾗ"]
["234419","愛知県","阿久比町","ｱｲﾁｹﾝ","ｱｸﾞｲﾁｮｳ"]
["234427","愛知県","東浦町","ｱｲﾁｹﾝ","ﾋｶﾞｼｳﾗﾁｮｳ"]
["234451","愛知県","南知多町","ｱｲﾁｹﾝ","ﾐﾅﾐﾁﾀﾁｮｳ"]
["234460","愛知県","美浜町","ｱｲﾁｹﾝ","ﾐﾊﾏﾁｮｳ"]
["234478","愛知県","武豊町","ｱｲﾁｹﾝ","ﾀｹﾄﾖﾁｮｳ"]
["235016","愛知県","幸田町","ｱｲﾁｹﾝ","ｺｳﾀﾁｮｳ"]
["235610","愛知県","設楽町","ｱｲﾁｹﾝ","ｼﾀﾗﾁｮｳ"]
["235628","愛知県","東栄町","ｱｲﾁｹﾝ","ﾄｳｴｲﾁｮｳ"]
["235636","愛知県","豊根村","ｱｲﾁｹﾝ","ﾄﾖﾈﾑﾗ"]
["240001","三重県",null,"ﾐｴｹﾝ"]
["242012","三重県","津市","ﾐｴｹﾝ","ﾂｼ"]
["242021","三重県","四日市市","ﾐｴｹﾝ","ﾖｯｶｲﾁｼ"]
["242039","三重県","伊勢市","ﾐｴｹﾝ","ｲｾｼ"]
["242047","三重県","松阪市","ﾐｴｹﾝ","ﾏﾂｻｶｼ"]
["242055","三重県","桑名市","ﾐｴｹﾝ","ｸﾜﾅｼ"]
["242071","三重県","鈴鹿市","ﾐｴｹﾝ","ｽｽﾞｶｼ"]
["242080","三重県","名張市","ﾐｴｹﾝ","ﾅﾊﾞﾘｼ"]
["242098","三重県","尾鷲市","ﾐｴｹﾝ","ｵﾜｾｼ"]
["242101","三重県","亀山市","ﾐｴｹﾝ","ｶﾒﾔﾏｼ"]
["242110","三重県","鳥羽市","ﾐｴｹﾝ","ﾄﾊﾞｼ"]
["242128","三重県","熊野市","ﾐｴｹﾝ","ｸﾏﾉｼ"]
["242144","三重県","いなべ市","ﾐｴｹﾝ","ｲﾅﾍﾞｼ"]
["242152","三重県","志摩市","ﾐｴｹﾝ","ｼﾏｼ"]
["242161","三重県","伊賀市","ﾐｴｹﾝ","ｲｶﾞｼ"]
["243035","三重県","木曽岬町","ﾐｴｹﾝ","ｷｿｻｷﾁｮｳ"]
["243248","三重県","東員町","ﾐｴｹﾝ","ﾄｳｲﾝﾁｮｳ"]
["243418","三重県","菰野町","ﾐｴｹﾝ","ｺﾓﾉﾁｮｳ"]
["243434","三重県","朝日町","ﾐｴｹﾝ","ｱｻﾋﾁｮｳ"]
["243442","三重県","川越町","ﾐｴｹﾝ","ｶﾜｺﾞｴﾁｮｳ"]
["244414","三重県","多気町","ﾐｴｹﾝ","ﾀｷﾁｮｳ"]
["244422","三重県","明和町","ﾐｴｹﾝ","ﾒｲﾜﾁｮｳ"]
["244431","三重県","大台町","ﾐｴｹﾝ","ｵｵﾀﾞｲﾁｮｳ"]
["244619","三重県","玉城町","ﾐｴｹﾝ","ﾀﾏｷﾁｮｳ"]
["244708","三重県","度会町","ﾐｴｹﾝ","ﾜﾀﾗｲﾁｮｳ"]
["244716","三重県","大紀町","ﾐｴｹﾝ","ﾀｲｷﾁｮｳ"]
["244724","三重県","南伊勢町","ﾐｴｹﾝ","ﾐﾅﾐｲｾﾁｮｳ"]
["245437","三重県","紀北町","ﾐｴｹﾝ","ｷﾎｸﾁｮｳ"]
["245615","三重県","御浜町","ﾐｴｹﾝ","ﾐﾊﾏﾁｮｳ"]
["245623","三重県","紀宝町","ﾐｴｹﾝ","ｷﾎｳﾁｮｳ"]
["250007","滋賀県",null,"ｼｶﾞｹﾝ"]
["252018","滋賀県","大津市","ｼｶﾞｹﾝ","ｵｵﾂｼ"]
["252026","滋賀県","彦根市","ｼｶﾞｹﾝ","ﾋｺﾈｼ"]
["252034","滋賀県","長浜市","ｼｶﾞｹﾝ","ﾅｶﾞﾊﾏｼ"]
["252042","滋賀県","近江八幡市","ｼｶﾞｹﾝ","ｵｳﾐﾊﾁﾏﾝｼ"]
["252069","滋賀県","草津市","ｼｶﾞｹﾝ","ｸｻﾂｼ"]
["252077","滋賀県","守山市","ｼｶﾞｹﾝ","ﾓﾘﾔﾏｼ"]
["252085","滋賀県","栗東市","ｼｶﾞｹﾝ","ﾘｯﾄｳｼ"]
["252093","滋賀県","甲賀市","ｼｶﾞｹﾝ","ｺｳｶｼ"]
["252107","滋賀県","野洲市","ｼｶﾞｹﾝ","ﾔｽｼ"]
["252115","滋賀県","湖南市","ｼｶﾞｹﾝ","ｺﾅﾝｼ"]
["252123","滋賀県","高島市","ｼｶﾞｹﾝ","ﾀｶｼﾏｼ"]
["252131","滋賀県","東近江市","ｼｶﾞｹﾝ","ﾋｶﾞｼｵｳﾐｼ"]
["252140","滋賀県","米原市","ｼｶﾞｹﾝ","ﾏｲﾊﾞﾗｼ"]
["253839","滋賀県","日野町","ｼｶﾞｹﾝ","ﾋﾉﾁｮｳ"]
["253847","滋賀県","竜王町","ｼｶﾞｹﾝ","ﾘﾕｳｵｳﾁｮｳ"]
["254258","滋賀県","愛荘町","ｼｶﾞｹﾝ","ｱｲｼｮｳﾁｮｳ"]
["254410","滋賀県","豊郷町","ｼｶﾞｹﾝ","ﾄﾖｻﾄﾁｮｳ"]
["254428","滋賀県","甲良町","ｼｶﾞｹﾝ","ｺｳﾗﾁｮｳ"]
["254436","滋賀県","多賀町","ｼｶﾞｹﾝ","ﾀｶﾞﾁｮｳ"]
["260002","京都府",null,"ｷｮｳﾄﾌ"]
["261009","京都府","京都市","ｷｮｳﾄﾌ","ｷｮｳﾄｼ"]
["262013","京都府","福知山市","ｷｮｳﾄﾌ","ﾌｸﾁﾔﾏｼ"]
["262021","京都府","舞鶴市","ｷｮｳﾄﾌ","ﾏｲﾂﾞﾙｼ"]
["262030","京都府","綾部市","ｷｮｳﾄﾌ","ｱﾔﾍﾞｼ"]
["262048","京都府","宇治市","ｷｮｳﾄﾌ","ｳｼﾞｼ"]
["262056","京都府","宮津市","ｷｮｳﾄﾌ","ﾐﾔﾂﾞｼ"]
["262064","京都府","亀岡市","ｷｮｳﾄﾌ","ｶﾒｵｶｼ"]
["262072","京都府","城陽市","ｷｮｳﾄﾌ","ｼﾞｮｳﾖｳｼ"]
["262081","京都府","向日市","ｷｮｳﾄﾌ","ﾑｺｳｼ"]
["262099","京都府","長岡京市","ｷｮｳﾄﾌ","ﾅｶﾞｵｶｷｮｳｼ"]
["262102","京都府","八幡市","ｷｮｳﾄﾌ","ﾔﾜﾀｼ"]
["262111","京都府","京田辺市","ｷｮｳﾄﾌ","ｷｮｳﾀﾅﾍﾞｼ"]
["262129","京都府","京丹後市","ｷｮｳﾄﾌ","ｷｮｳﾀﾝｺﾞｼ"]
["262137","京都府","南丹市","ｷｮｳﾄﾌ","ﾅﾝﾀﾝｼ"]
["262145","京都府","木津川市","ｷｮｳﾄﾌ","ｷﾂﾞｶﾞﾜｼ"]
["263036","京都府","大山崎町","ｷｮｳﾄﾌ","ｵｵﾔﾏｻﾞｷﾁｮｳ"]
["263222","京都府","久御山町","ｷｮｳﾄﾌ","ｸﾐﾔﾏﾁｮｳ"]
["263435","京都府","井手町","ｷｮｳﾄﾌ","ｲﾃﾞﾁｮｳ"]
["263443","京都府","宇治田原町","ｷｮｳﾄﾌ","ｳｼﾞﾀﾜﾗﾁｮｳ"]
["263648","京都府","笠置町","ｷｮｳﾄﾌ","ｶｻｷﾞﾁｮｳ"]
["263656","京都府","和束町","ｷｮｳﾄﾌ","ﾜﾂﾞｶﾁｮｳ"]
["263664","京都府","精華町","ｷｮｳﾄﾌ","ｾｲｶﾁｮｳ"]
["263672","京都府","南山城村","ｷｮｳﾄﾌ","ﾐﾅﾐﾔﾏｼﾛﾑﾗ"]
["264075","京都府","京丹波町","ｷｮｳﾄﾌ","ｷｮｳﾀﾝﾊﾞﾁｮｳ"]
["264636","京都府","伊根町","ｷｮｳﾄﾌ","ｲﾈﾁｮｳ"]
["264652","京都府","与謝野町","ｷｮｳﾄﾌ","ﾖｻﾉﾁｮｳ"]
["270008","大阪府",null,"ｵｵｻｶﾌ"]
["271004","大阪府","大阪市","ｵｵｻｶﾌ","ｵｵｻｶｼ"]
["271403","大阪府","堺市","ｵｵｻｶﾌ","ｻｶｲｼ"]
["272027","大阪府","岸和田市","ｵｵｻｶﾌ","ｷｼﾜﾀﾞｼ"]
["272035","大阪府","豊中市","ｵｵｻｶﾌ","ﾄﾖﾅｶｼ"]
["272043","大阪府","池田市","ｵｵｻｶﾌ","ｲｹﾀﾞｼ"]
["272051","大阪府","吹田市","ｵｵｻｶﾌ","ｽｲﾀｼ"]
["272060","大阪府","泉大津市","ｵｵｻｶﾌ","ｲｽﾞﾐｵｵﾂｼ"]
["272078","大阪府","高槻市","ｵｵｻｶﾌ","ﾀｶﾂｷｼ"]
["272086","大阪府","貝塚市","ｵｵｻｶﾌ","ｶｲﾂﾞｶｼ"]
["272094","大阪府","守口市","ｵｵｻｶﾌ","ﾓﾘｸﾞﾁｼ"]
["272108","大阪府","枚方市","ｵｵｻｶﾌ","ﾋﾗｶﾀｼ"]
["272116","大阪府","茨木市","ｵｵｻｶﾌ","ｲﾊﾞﾗｷｼ"]
["272124","大阪府","八尾市","ｵｵｻｶﾌ","ﾔｵｼ"]
["272132","大阪府","泉佐野市","ｵｵｻｶﾌ","ｲｽﾞﾐｻﾉｼ"]
["272141","大阪府","富田林市","ｵｵｻｶﾌ","ﾄﾝﾀﾞﾊﾞﾔｼｼ"]
["272159","大阪府","寝屋川市","ｵｵｻｶﾌ","ﾈﾔｶﾞﾜｼ"]
["272167","大阪府","河内長野市","ｵｵｻｶﾌ","ｶﾜﾁﾅｶﾞﾉｼ"]
["272175","大阪府","松原市","ｵｵｻｶﾌ","ﾏﾂﾊﾞﾗｼ"]
["272183","大阪府","大東市","ｵｵｻｶﾌ","ﾀﾞｲﾄｳｼ"]
["272191","大阪府","和泉市","ｵｵｻｶﾌ","ｲｽﾞﾐｼ"]
["272205","大阪府","箕面市","ｵｵｻｶﾌ","ﾐﾉｵｼ"]
["272213","大阪府","柏原市","ｵｵｻｶﾌ","ｶｼﾜﾗｼ"]
["272221","大阪府","羽曳野市","ｵｵｻｶﾌ","ﾊﾋﾞｷﾉｼ"]
["272230","大阪府","門真市","ｵｵｻｶﾌ","ｶﾄﾞﾏｼ"]
["272248","大阪府","摂津市","ｵｵｻｶﾌ","ｾｯﾂｼ"]
["272256","大阪府","高石市","ｵｵｻｶﾌ","ﾀｶｲｼｼ"]
["272264","大阪府","藤井寺市","ｵｵｻｶﾌ","ﾌｼﾞｲﾃﾞﾗｼ"]
["272272","大阪府","東大阪市","ｵｵｻｶﾌ","ﾋｶﾞｼｵｵｻｶｼ"]
["272281","大阪府","泉南市","ｵｵｻｶﾌ","ｾﾝﾅﾝｼ"]
["272299","大阪府","四條畷市","ｵｵｻｶﾌ","ｼｼﾞﾖｳﾅﾜﾃｼ"]
["272302","大阪府","交野市","ｵｵｻｶﾌ","ｶﾀﾉｼ"]
["272311","大阪府","大阪狭山市","ｵｵｻｶﾌ","ｵｵｻｶｻﾔﾏｼ"]
["272329","大阪府","阪南市","ｵｵｻｶﾌ","ﾊﾝﾅﾝｼ"]
["273015","大阪府","島本町","ｵｵｻｶﾌ","ｼﾏﾓﾄﾁｮｳ"]
["273210","大阪府","豊能町","ｵｵｻｶﾌ","ﾄﾖﾉﾁｮｳ"]
["273228","大阪府","能勢町","ｵｵｻｶﾌ","ﾉｾﾁｮｳ"]
["273414","大阪府","忠岡町","ｵｵｻｶﾌ","ﾀﾀﾞｵｶﾁｮｳ"]
["273619","大阪府","熊取町","ｵｵｻｶﾌ","ｸﾏﾄﾘﾁｮｳ"]
["273627","大阪府","田尻町","ｵｵｻｶﾌ","ﾀｼﾞﾘﾁｮｳ"]
["273660","大阪府","岬町","ｵｵｻｶﾌ","ﾐｻｷﾁｮｳ"]
["273813","大阪府","太子町","ｵｵｻｶﾌ","ﾀｲｼﾁｮｳ"]
["273821","大阪府","河南町","ｵｵｻｶﾌ","ｶﾅﾝﾁｮｳ"]
["273830","大阪府","千早赤阪村","ｵｵｻｶﾌ","ﾁﾊﾔｱｶｻｶﾑﾗ"]
["280003","兵庫県",null,"ﾋｮｳｺﾞｹﾝ"]
["281000","兵庫県","神戸市","ﾋｮｳｺﾞｹﾝ","ｺｳﾍﾞｼ"]
["282014","兵庫県","姫路市","ﾋｮｳｺﾞｹﾝ","ﾋﾒｼﾞｼ"]
["282022","兵庫県","尼崎市","ﾋｮｳｺﾞｹﾝ","ｱﾏｶﾞｻｷｼ"]
["282031","兵庫県","明石市","ﾋｮｳｺﾞｹﾝ","ｱｶｼｼ"]
["282049","兵庫県","西宮市","ﾋｮｳｺﾞｹﾝ","ﾆｼﾉﾐﾔｼ"]
["282057","兵庫県","洲本市","ﾋｮｳｺﾞｹﾝ","ｽﾓﾄｼ"]
["282065","兵庫県","芦屋市","ﾋｮｳｺﾞｹﾝ","ｱｼﾔｼ"]
["282073","兵庫県","伊丹市","ﾋｮｳｺﾞｹﾝ","ｲﾀﾐｼ"]
["282081","兵庫県","相生市","ﾋｮｳｺﾞｹﾝ","ｱｲｵｲｼ"]
["282090","兵庫県","豊岡市","ﾋｮｳｺﾞｹﾝ","ﾄﾖｵｶｼ"]
["282103","兵庫県","加古川市","ﾋｮｳｺﾞｹﾝ","ｶｺｶﾞﾜｼ"]
["282120","兵庫県","赤穂市","ﾋｮｳｺﾞｹﾝ","ｱｺｳｼ"]
["282138","兵庫県","西脇市","ﾋｮｳｺﾞｹﾝ","ﾆｼﾜｷｼ"]
["282146","兵庫県","宝塚市","ﾋｮｳｺﾞｹﾝ","ﾀｶﾗﾂﾞｶｼ"]
["282154","兵庫県","三木市","ﾋｮｳｺﾞｹﾝ","ﾐｷｼ"]
["282162","兵庫県","高砂市","ﾋｮｳｺﾞｹﾝ","ﾀｶｻｺﾞｼ"]
["282171","兵庫県","川西市","ﾋｮｳｺﾞｹﾝ","ｶﾜﾆｼｼ"]
["282189","兵庫県","小野市","ﾋｮｳｺﾞｹﾝ","ｵﾉｼ"]
["282197","兵庫県","三田市","ﾋｮｳｺﾞｹﾝ","ｻﾝﾀﾞｼ"]
["282201","兵庫県","加西市","ﾋｮｳｺﾞｹﾝ","ｶｻｲｼ"]
["282219","兵庫県","丹波篠山市","ﾋｮｳｺﾞｹﾝ","ﾀﾝﾊﾞｻｻﾔﾏｼ"]
["282227","兵庫県","養父市","ﾋｮｳｺﾞｹﾝ","ﾔﾌﾞｼ"]
["282235","兵庫県","丹波市","ﾋｮｳｺﾞｹﾝ","ﾀﾝﾊﾞｼ"]
["282243","兵庫県","南あわじ市","ﾋｮｳｺﾞｹﾝ","ﾐﾅﾐｱﾜｼﾞｼ"]
["282251","兵庫県","朝来市","ﾋｮｳｺﾞｹﾝ","ｱｻｺﾞｼ"]
["282260","兵庫県","淡路市","ﾋｮｳｺﾞｹﾝ","ｱﾜｼﾞｼ"]
["282278","兵庫県","宍粟市","ﾋｮｳｺﾞｹﾝ","ｼｿｳｼ"]
["282286","兵庫県","加東市","ﾋｮｳｺﾞｹﾝ","ｶﾄｳｼ"]
["282294","兵庫県","たつの市","ﾋｮｳｺﾞｹﾝ","ﾀﾂﾉｼ"]
["283011","兵庫県","猪名川町","ﾋｮｳｺﾞｹﾝ","ｲﾅｶﾞﾜﾁｮｳ"]
["283657","兵庫県","多可町","ﾋｮｳｺﾞｹﾝ","ﾀｶﾁｮｳ"]
["283819","兵庫県","稲美町","ﾋｮｳｺﾞｹﾝ","ｲﾅﾐﾁｮｳ"]
["283827","兵庫県","播磨町","ﾋｮｳｺﾞｹﾝ","ﾊﾘﾏﾁｮｳ"]
["284424","兵庫県","市川町","ﾋｮｳｺﾞｹﾝ","ｲﾁｶﾜﾁｮｳ"]
["284432","兵庫県","福崎町","ﾋｮｳｺﾞｹﾝ","ﾌｸｻｷﾁｮｳ"]
["284467","兵庫県","神河町","ﾋｮｳｺﾞｹﾝ","ｶﾐｶﾜﾁｮｳ"]
["284645","兵庫県","太子町","ﾋｮｳｺﾞｹﾝ","ﾀｲｼﾁｮｳ"]
["284815","兵庫県","上郡町","ﾋｮｳｺﾞｹﾝ","ｶﾐｺﾞｵﾘﾁｮｳ"]
["285013","兵庫県","佐用町","ﾋｮｳｺﾞｹﾝ","ｻﾖｳﾁｮｳ"]
["285854","兵庫県","香美町","ﾋｮｳｺﾞｹﾝ","ｶﾐﾁｮｳ"]
["285862","兵庫県","新温泉町","ﾋｮｳｺﾞｹﾝ","ｼﾝｵﾝｾﾝﾁｮｳ"]
["290009","奈良県",null,"ﾅﾗｹﾝ"]
["292010","奈良県","奈良市","ﾅﾗｹﾝ","ﾅﾗｼ"]
["292028","奈良県","大和高田市","ﾅﾗｹﾝ","ﾔﾏﾄﾀｶﾀﾞｼ"]
["292036","奈良県","大和郡山市","ﾅﾗｹﾝ","ﾔﾏﾄｺｵﾘﾔﾏｼ"]
["292044","奈良県","天理市","ﾅﾗｹﾝ","ﾃﾝﾘｼ"]
["292052","奈良県","橿原市","ﾅﾗｹﾝ","ｶｼﾊﾗｼ"]
["292061","奈良県","桜井市","ﾅﾗｹﾝ","ｻｸﾗｲｼ"]
["292079","奈良県","五條市","ﾅﾗｹﾝ","ｺﾞｼﾞｮｳｼ"]
["292087","奈良県","御所市","ﾅﾗｹﾝ","ｺﾞｾｼ"]
["292095","奈良県","生駒市","ﾅﾗｹﾝ","ｲｺﾏｼ"]
["292109","奈良県","香芝市","ﾅﾗｹﾝ","ｶｼﾊﾞｼ"]
["292117","奈良県","葛城市","ﾅﾗｹﾝ","ｶﾂﾗｷﾞｼ"]
["292125","奈良県","宇陀市","ﾅﾗｹﾝ","ｳﾀﾞｼ"]
["293229","奈良県","山添村","ﾅﾗｹﾝ","ﾔﾏｿﾞｴﾑﾗ"]
["293423","奈良県","平群町","ﾅﾗｹﾝ","ﾍｸﾞﾘﾁｮｳ"]
["293431","奈良県","三郷町","ﾅﾗｹﾝ","ｻﾝｺﾞｳﾁｮｳ"]
["293440","奈良県","斑鳩町","ﾅﾗｹﾝ","ｲｶﾙｶﾞﾁｮｳ"]
["293458","奈良県","安堵町","ﾅﾗｹﾝ","ｱﾝﾄﾞﾁｮｳ"]
["293610","奈良県","川西町","ﾅﾗｹﾝ","ｶﾜﾆｼﾁｮｳ"]
["293628","奈良県","三宅町","ﾅﾗｹﾝ","ﾐﾔｹﾁｮｳ"]
["293636","奈良県","田原本町","ﾅﾗｹﾝ","ﾀﾜﾗﾓﾄﾁｮｳ"]
["293857","奈良県","曽爾村","ﾅﾗｹﾝ","ｿﾆﾑﾗ"]
["293865","奈良県","御杖村","ﾅﾗｹﾝ","ﾐﾂｴﾑﾗ"]
["294012","奈良県","高取町","ﾅﾗｹﾝ","ﾀｶﾄﾘﾁｮｳ"]
["294021","奈良県","明日香村","ﾅﾗｹﾝ","ｱｽｶﾑﾗ"]
["294241","奈良県","上牧町","ﾅﾗｹﾝ","ｶﾝﾏｷﾁｮｳ"]
["294250","奈良県","王寺町","ﾅﾗｹﾝ","ｵｳｼﾞﾁｮｳ"]
["294268","奈良県","広陵町","ﾅﾗｹﾝ","ｺｳﾘﾖｳﾁｮｳ"]
["294276","奈良県","河合町","ﾅﾗｹﾝ","ｶﾜｲﾁｮｳ"]
["294411","奈良県","吉野町","ﾅﾗｹﾝ","ﾖｼﾉﾁｮｳ"]
["294420","奈良県","大淀町","ﾅﾗｹﾝ","ｵｵﾖﾄﾞﾁｮｳ"]
["294438","奈良県","下市町","ﾅﾗｹﾝ","ｼﾓｲﾁﾁｮｳ"]
["294446","奈良県","黒滝村","ﾅﾗｹﾝ","ｸﾛﾀｷﾑﾗ"]
["294462","奈良県","天川村","ﾅﾗｹﾝ","ﾃﾝｶﾜﾑﾗ"]
["294471","奈良県","野迫川村","ﾅﾗｹﾝ","ﾉｾｶﾞﾜﾑﾗ"]
["294497","奈良県","十津川村","ﾅﾗｹﾝ","ﾄﾂｶﾜﾑﾗ"]
["294501","奈良県","下北山村","ﾅﾗｹﾝ","ｼﾓｷﾀﾔﾏﾑﾗ"]
["294519","奈良県","上北山村","ﾅﾗｹﾝ","ｶﾐｷﾀﾔﾏﾑﾗ"]
["294527","奈良県","川上村","ﾅﾗｹﾝ","ｶﾜｶﾐﾑﾗ"]
["294535","奈良県","東吉野村","ﾅﾗｹﾝ","ﾋｶﾞｼﾖｼﾉﾑﾗ"]
["300004","和歌山県",null,"ﾜｶﾔﾏｹﾝ"]
["302015","和歌山県","和歌山市","ﾜｶﾔﾏｹﾝ","ﾜｶﾔﾏｼ"]
["302023","和歌山県","海南市","ﾜｶﾔﾏｹﾝ","ｶｲﾅﾝｼ"]
["302031","和歌山県","橋本市","ﾜｶﾔﾏｹﾝ","ﾊｼﾓﾄｼ"]
["302040","和歌山県","有田市","ﾜｶﾔﾏｹﾝ","ｱﾘﾀﾞｼ"]
["302058","和歌山県","御坊市","ﾜｶﾔﾏｹﾝ","ｺﾞﾎﾞｳｼ"]
["302066","和歌山県","田辺市","ﾜｶﾔﾏｹﾝ","ﾀﾅﾍﾞｼ"]
["302074","和歌山県","新宮市","ﾜｶﾔﾏｹﾝ","ｼﾝｸﾞｳｼ"]
["302082","和歌山県","紀の川市","ﾜｶﾔﾏｹﾝ","ｷﾉｶﾜｼ"]
["302091","和歌山県","岩出市","ﾜｶﾔﾏｹﾝ","ｲﾜﾃﾞｼ"]
["303046","和歌山県","紀美野町","ﾜｶﾔﾏｹﾝ","ｷﾐﾉﾁｮｳ"]
["303411","和歌山県","かつらぎ町","ﾜｶﾔﾏｹﾝ","ｶﾂﾗｷﾞﾁｮｳ"]
["303437","和歌山県","九度山町","ﾜｶﾔﾏｹﾝ","ｸﾄﾞﾔﾏﾁｮｳ"]
["303445","和歌山県","高野町","ﾜｶﾔﾏｹﾝ","ｺｳﾔﾁｮｳ"]
["303615","和歌山県","湯浅町","ﾜｶﾔﾏｹﾝ","ﾕｱｻﾁｮｳ"]
["303623","和歌山県","広川町","ﾜｶﾔﾏｹﾝ","ﾋﾛｶﾞﾜﾁｮｳ"]
["303666","和歌山県","有田川町","ﾜｶﾔﾏｹﾝ","ｱﾘﾀﾞｶﾞﾜﾁｮｳ"]
["303810","和歌山県","美浜町","ﾜｶﾔﾏｹﾝ","ﾐﾊﾏﾁｮｳ"]
["303828","和歌山県","日高町","ﾜｶﾔﾏｹﾝ","ﾋﾀﾞｶﾁｮｳ"]
["303836","和歌山県","由良町","ﾜｶﾔﾏｹﾝ","ﾕﾗﾁｮｳ"]
["303909","和歌山県","印南町","ﾜｶﾔﾏｹﾝ","ｲﾅﾐﾁｮｳ"]
["303917","和歌山県","みなべ町","ﾜｶﾔﾏｹﾝ","ﾐﾅﾍﾞﾁｮｳ"]
["303925","和歌山県","日高川町","ﾜｶﾔﾏｹﾝ","ﾋﾀﾞｶｶﾞﾜﾁｮｳ"]
["304018","和歌山県","白浜町","ﾜｶﾔﾏｹﾝ","ｼﾗﾊﾏﾁｮｳ"]
["304042","和歌山県","上富田町","ﾜｶﾔﾏｹﾝ","ｶﾐﾄﾝﾀﾞﾁｮｳ"]
["304069","和歌山県","すさみ町","ﾜｶﾔﾏｹﾝ","ｽｻﾐﾁｮｳ"]
["304212","和歌山県","那智勝浦町","ﾜｶﾔﾏｹﾝ","ﾅﾁｶﾂｳﾗﾁｮｳ"]
["304221","和歌山県","太地町","ﾜｶﾔﾏｹﾝ","ﾀｲｼﾞﾁｮｳ"]
["304247","和歌山県","古座川町","ﾜｶﾔﾏｹﾝ","ｺｻﾞｶﾞﾜﾁｮｳ"]
["304271","和歌山県","北山村","ﾜｶﾔﾏｹﾝ","ｷﾀﾔﾏﾑﾗ"]
["304280","和歌山県","串本町","ﾜｶﾔﾏｹﾝ","ｸｼﾓﾄﾁｮｳ"]
["310000","鳥取県",null,"ﾄｯﾄﾘｹﾝ"]
["312011","鳥取県","鳥取市","ﾄｯﾄﾘｹﾝ","ﾄｯﾄﾘｼ"]
["312029","鳥取県","米子市","ﾄｯﾄﾘｹﾝ","ﾖﾅｺﾞｼ"]
["312037","鳥取県","倉吉市","ﾄｯﾄﾘｹﾝ","ｸﾗﾖｼｼ"]
["312045","鳥取県","境港市","ﾄｯﾄﾘｹﾝ","ｻｶｲﾐﾅﾄｼ"]
["313025","鳥取県","岩美町","ﾄｯﾄﾘｹﾝ","ｲﾜﾐﾁｮｳ"]
["313254","鳥取県","若桜町","ﾄｯﾄﾘｹﾝ","ﾜｶｻﾁｮｳ"]
["313289","鳥取県","智頭町","ﾄｯﾄﾘｹﾝ","ﾁﾂﾞﾁｮｳ"]
["313297","鳥取県","八頭町","ﾄｯﾄﾘｹﾝ","ﾔｽﾞﾁｮｳ"]
["313645","鳥取県","三朝町","ﾄｯﾄﾘｹﾝ","ﾐｻｻﾁｮｳ"]
["313700","鳥取県","湯梨浜町","ﾄｯﾄﾘｹﾝ","ﾕﾘﾊﾏﾁｮｳ"]
["313718","鳥取県","琴浦町","ﾄｯﾄﾘｹﾝ","ｺﾄｳﾗﾁｮｳ"]
["313726","鳥取県","北栄町","ﾄｯﾄﾘｹﾝ","ﾎｸｴｲﾁｮｳ"]
["313840","鳥取県","日吉津村","ﾄｯﾄﾘｹﾝ","ﾋｴﾂﾞｿﾝ"]
["313866","鳥取県","大山町","ﾄｯﾄﾘｹﾝ","ﾀﾞｲｾﾝﾁｮｳ"]
["313891","鳥取県","南部町","ﾄｯﾄﾘｹﾝ","ﾅﾝﾌﾞﾁｮｳ"]
["313904","鳥取県","伯耆町","ﾄｯﾄﾘｹﾝ","ﾎｳｷﾁｮｳ"]
["314013","鳥取県","日南町","ﾄｯﾄﾘｹﾝ","ﾆﾁﾅﾝﾁｮｳ"]
["314021","鳥取県","日野町","ﾄｯﾄﾘｹﾝ","ﾋﾉﾁｮｳ"]
["314030","鳥取県","江府町","ﾄｯﾄﾘｹﾝ","ｺｳﾌﾁｮｳ"]
["320005","島根県",null,"ｼﾏﾈｹﾝ"]
["322016","島根県","松江市","ｼﾏﾈｹﾝ","ﾏﾂｴｼ"]
["322024","島根県","浜田市","ｼﾏﾈｹﾝ","ﾊﾏﾀﾞｼ"]
["322032","島根県","出雲市","ｼﾏﾈｹﾝ","ｲｽﾞﾓｼ"]
["322041","島根県","益田市","ｼﾏﾈｹﾝ","ﾏｽﾀﾞｼ"]
["322059","島根県","大田市","ｼﾏﾈｹﾝ","ｵｵﾀﾞｼ"]
["322067","島根県","安来市","ｼﾏﾈｹﾝ","ﾔｽｷﾞｼ"]
["322075","島根県","江津市","ｼﾏﾈｹﾝ","ｺﾞｳﾂｼ"]
["322091","島根県","雲南市","ｼﾏﾈｹﾝ","ｳﾝﾅﾝｼ"]
["323438","島根県","奥出雲町","ｼﾏﾈｹﾝ","ｵｸｲｽﾞﾓﾁｮｳ"]
["323861","島根県","飯南町","ｼﾏﾈｹﾝ","ｲｲﾅﾝﾁｮｳ"]
["324418","島根県","川本町","ｼﾏﾈｹﾝ","ｶﾜﾓﾄﾏﾁ"]
["324485","島根県","美郷町","ｼﾏﾈｹﾝ","ﾐｻﾄﾁｮｳ"]
["324493","島根県","邑南町","ｼﾏﾈｹﾝ","ｵｵﾅﾝﾁｮｳ"]
["325015","島根県","津和野町","ｼﾏﾈｹﾝ","ﾂﾜﾉﾁｮｳ"]
["325058","島根県","吉賀町","ｼﾏﾈｹﾝ","ﾖｼｶﾁｮｳ"]
["325252","島根県","海士町","ｼﾏﾈｹﾝ","ｱﾏﾁｮｳ"]
["325261","島根県","西ノ島町","ｼﾏﾈｹﾝ","ﾆｼﾉｼﾏﾁｮｳ"]
["325279","島根県","知夫村","ｼﾏﾈｹﾝ","ﾁﾌﾞﾑﾗ"]
["325287","島根県","隠岐の島町","ｼﾏﾈｹﾝ","ｵｷﾉｼﾏﾁｮｳ"]
["330001","岡山県",null,"ｵｶﾔﾏｹﾝ"]
["331007","岡山県","岡山市","ｵｶﾔﾏｹﾝ","ｵｶﾔﾏｼ"]
["332020","岡山県","倉敷市","ｵｶﾔﾏｹﾝ","ｸﾗｼｷｼ"]
["332038","岡山県","津山市","ｵｶﾔﾏｹﾝ","ﾂﾔﾏｼ"]
["332046","岡山県","玉野市","ｵｶﾔﾏｹﾝ","ﾀﾏﾉｼ"]
["332054","岡山県","笠岡市","ｵｶﾔﾏｹﾝ","ｶｻｵｶｼ"]
["332071","岡山県","井原市","ｵｶﾔﾏｹﾝ","ｲﾊﾞﾗｼ"]
["332089","岡山県","総社市","ｵｶﾔﾏｹﾝ","ｿｳｼﾞﾔｼ"]
["332097","岡山県","高梁市","ｵｶﾔﾏｹﾝ","ﾀｶﾊｼｼ"]
["332101","岡山県","新見市","ｵｶﾔﾏｹﾝ","ﾆｲﾐｼ"]
["332119","岡山県","備前市","ｵｶﾔﾏｹﾝ","ﾋﾞｾﾞﾝｼ"]
["332127","岡山県","瀬戸内市","ｵｶﾔﾏｹﾝ","ｾﾄｳﾁｼ"]
["332135","岡山県","赤磐市","ｵｶﾔﾏｹﾝ","ｱｶｲﾜｼ"]
["332143","岡山県","真庭市","ｵｶﾔﾏｹﾝ","ﾏﾆﾜｼ"]
["332151","岡山県","美作市","ｵｶﾔﾏｹﾝ","ﾐﾏｻｶｼ"]
["332160","岡山県","浅口市","ｵｶﾔﾏｹﾝ","ｱｻｸﾁｼ"]
["333468","岡山県","和気町","ｵｶﾔﾏｹﾝ","ﾜｹﾁｮｳ"]
["334235","岡山県","早島町","ｵｶﾔﾏｹﾝ","ﾊﾔｼﾏﾁｮｳ"]
["334456","岡山県","里庄町","ｵｶﾔﾏｹﾝ","ｻﾄｼｮｳﾁｮｳ"]
["334618","岡山県","矢掛町","ｵｶﾔﾏｹﾝ","ﾔｶｹﾞﾁｮｳ"]
["335860","岡山県","新庄村","ｵｶﾔﾏｹﾝ","ｼﾝｼﾞﾖｳｿﾝ"]
["336068","岡山県","鏡野町","ｵｶﾔﾏｹﾝ","ｶｶﾞﾐﾉﾁｮｳ"]
["336220","岡山県","勝央町","ｵｶﾔﾏｹﾝ","ｼｮｳｵｳﾁｮｳ"]
["336238","岡山県","奈義町","ｵｶﾔﾏｹﾝ","ﾅｷﾞﾁｮｳ"]
["336432","岡山県","西粟倉村","ｵｶﾔﾏｹﾝ","ﾆｼｱﾜｸﾗｿﾝ"]
["336637","岡山県","久米南町","ｵｶﾔﾏｹﾝ","ｸﾒﾅﾝﾁｮｳ"]
["336661","岡山県","美咲町","ｵｶﾔﾏｹﾝ","ﾐｻｷﾁｮｳ"]
["336815","岡山県","吉備中央町","ｵｶﾔﾏｹﾝ","ｷﾋﾞﾁｭｳｵｳﾁｮｳ"]
["340006","広島県",null,"ﾋﾛｼﾏｹﾝ"]
["341002","広島県","広島市","ﾋﾛｼﾏｹﾝ","ﾋﾛｼﾏｼ"]
["342025","広島県","呉市","ﾋﾛｼﾏｹﾝ","ｸﾚｼ"]
["342033","広島県","竹原市","ﾋﾛｼﾏｹﾝ","ﾀｹﾊﾗｼ"]
["342041","広島県","三原市","ﾋﾛｼﾏｹﾝ","ﾐﾊﾗｼ"]
["342050","広島県","尾道市","ﾋﾛｼﾏｹﾝ","ｵﾉﾐﾁｼ"]
["342076","広島県","福山市","ﾋﾛｼﾏｹﾝ","ﾌｸﾔﾏｼ"]
["342084","広島県","府中市","ﾋﾛｼﾏｹﾝ","ﾌﾁｭｳｼ"]
["342092","広島県","三次市","ﾋﾛｼﾏｹﾝ","ﾐﾖｼｼ"]
["342106","広島県","庄原市","ﾋﾛｼﾏｹﾝ","ｼｮｳﾊﾞﾗｼ"]
["342114","広島県","大竹市","ﾋﾛｼﾏｹﾝ","ｵｵﾀｹｼ"]
["342122","広島県","東広島市","ﾋﾛｼﾏｹﾝ","ﾋｶﾞｼﾋﾛｼﾏｼ"]
["342131","広島県","廿日市市","ﾋﾛｼﾏｹﾝ","ﾊﾂｶｲﾁｼ"]
["342149","広島県","安芸高田市","ﾋﾛｼﾏｹﾝ","ｱｷﾀｶﾀｼ"]
["342157","広島県","江田島市","ﾋﾛｼﾏｹﾝ","ｴﾀｼﾞﾏｼ"]
["343021","広島県","府中町","ﾋﾛｼﾏｹﾝ","ﾌﾁｭｳﾁｮｳ"]
["343048","広島県","海田町","ﾋﾛｼﾏｹﾝ","ｶｲﾀﾁｮｳ"]
["343072","広島県","熊野町","ﾋﾛｼﾏｹﾝ","ｸﾏﾉﾁｮｳ"]
["343099","広島県","坂町","ﾋﾛｼﾏｹﾝ","ｻｶﾁｮｳ"]
["343684","広島県","安芸太田町","ﾋﾛｼﾏｹﾝ","ｱｷｵｵﾀﾁｮｳ"]
["343692","広島県","北広島町","ﾋﾛｼﾏｹﾝ","ｷﾀﾋﾛｼﾏﾁｮｳ"]
["344311","広島県","大崎上島町","ﾋﾛｼﾏｹﾝ","ｵｵｻｷｶﾐｼﾞﾏﾁｮｳ"]
["344621","広島県","世羅町","ﾋﾛｼﾏｹﾝ","ｾﾗﾁｮｳ"]
["345458","広島県","神石高原町","ﾋﾛｼﾏｹﾝ","ｼﾞﾝｾｷｺｳｹﾞﾝﾁｮｳ"]
["350001","山口県",null,"ﾔﾏｸﾞﾁｹﾝ"]
["352012","山口県","下関市","ﾔﾏｸﾞﾁｹﾝ","ｼﾓﾉｾｷｼ"]
["352021","山口県","宇部市","ﾔﾏｸﾞﾁｹﾝ","ｳﾍﾞｼ"]
["352039","山口県","山口市","ﾔﾏｸﾞﾁｹﾝ","ﾔﾏｸﾞﾁｼ"]
["352047","山口県","萩市","ﾔﾏｸﾞﾁｹﾝ","ﾊｷﾞｼ"]
["352063","山口県","防府市","ﾔﾏｸﾞﾁｹﾝ","ﾎｳﾌｼ"]
["352071","山口県","下松市","ﾔﾏｸﾞﾁｹﾝ","ｸﾀﾞﾏﾂｼ"]
["352080","山口県","岩国市","ﾔﾏｸﾞﾁｹﾝ","ｲﾜｸﾆｼ"]
["352101","山口県","光市","ﾔﾏｸﾞﾁｹﾝ","ﾋｶﾘｼ"]
["352110","山口県","長門市","ﾔﾏｸﾞﾁｹﾝ","ﾅｶﾞﾄｼ"]
["352128","山口県","柳井市","ﾔﾏｸﾞﾁｹﾝ","ﾔﾅｲｼ"]
["352136","山口県","美祢市","ﾔﾏｸﾞﾁｹﾝ","ﾐﾈｼ"]
["352152","山口県","周南市","ﾔﾏｸﾞﾁｹﾝ","ｼｭｳﾅﾝｼ"]
["352161","山口県","山陽小野田市","ﾔﾏｸﾞﾁｹﾝ","ｻﾝﾖｳｵﾉﾀﾞｼ"]
["353051","山口県","周防大島町","ﾔﾏｸﾞﾁｹﾝ","ｽｵｳｵｵｼﾏﾁｮｳ"]
["353213","山口県","和木町","ﾔﾏｸﾞﾁｹﾝ","ﾜｷﾁｮｳ"]
["353418","山口県","上関町","ﾔﾏｸﾞﾁｹﾝ","ｶﾐﾉｾｷﾁｮｳ"]
["353434","山口県","田布施町","ﾔﾏｸﾞﾁｹﾝ","ﾀﾌﾞｾﾁｮｳ"]
["353442","山口県","平生町","ﾔﾏｸﾞﾁｹﾝ","ﾋﾗｵﾁｮｳ"]
["355020","山口県","阿武町","ﾔﾏｸﾞﾁｹﾝ","ｱﾌﾞﾁｮｳ"]
["360007","徳島県",null,"ﾄｸｼﾏｹﾝ"]
["362018","徳島県","徳島市","ﾄｸｼﾏｹﾝ","ﾄｸｼﾏｼ"]
["362026","徳島県","鳴門市","ﾄｸｼﾏｹﾝ","ﾅﾙﾄｼ"]
["362034","徳島県","小松島市","ﾄｸｼﾏｹﾝ","ｺﾏﾂｼﾏｼ"]
["362042","徳島県","阿南市","ﾄｸｼﾏｹﾝ","ｱﾅﾝｼ"]
["362051","徳島県","吉野川市","ﾄｸｼﾏｹﾝ","ﾖｼﾉｶﾞﾜｼ"]
["362069","徳島県","阿波市","ﾄｸｼﾏｹﾝ","ｱﾜｼ"]
["362077","徳島県","美馬市","ﾄｸｼﾏｹﾝ","ﾐﾏｼ"]
["362085","徳島県","三好市","ﾄｸｼﾏｹﾝ","ﾐﾖｼｼ"]
["363014","徳島県","勝浦町","ﾄｸｼﾏｹﾝ","ｶﾂｳﾗﾁｮｳ"]
["363022","徳島県","上勝町","ﾄｸｼﾏｹﾝ","ｶﾐｶﾂﾁｮｳ"]
["363219","徳島県","佐那河内村","ﾄｸｼﾏｹﾝ","ｻﾅｺﾞｳﾁｿﾝ"]
["363413","徳島県","石井町","ﾄｸｼﾏｹﾝ","ｲｼｲﾁｮｳ"]
["363421","徳島県","神山町","ﾄｸｼﾏｹﾝ","ｶﾐﾔﾏﾁｮｳ"]
["363685","徳島県","那賀町","ﾄｸｼﾏｹﾝ","ﾅｶﾁｮｳ"]
["363839","徳島県","牟岐町","ﾄｸｼﾏｹﾝ","ﾑｷﾞﾁｮｳ"]
["363871","徳島県","美波町","ﾄｸｼﾏｹﾝ","ﾐﾅﾐﾁｮｳ"]
["363880","徳島県","海陽町","ﾄｸｼﾏｹﾝ","ｶｲﾖｳﾁｮｳ"]
["364011","徳島県","松茂町","ﾄｸｼﾏｹﾝ","ﾏﾂｼｹﾞﾁｮｳ"]
["364029","徳島県","北島町","ﾄｸｼﾏｹﾝ","ｷﾀｼﾞﾏﾁｮｳ"]
["364037","徳島県","藍住町","ﾄｸｼﾏｹﾝ","ｱｲｽﾞﾐﾁｮｳ"]
["364045","徳島県","板野町","ﾄｸｼﾏｹﾝ","ｲﾀﾉﾁｮｳ"]
["364053","徳島県","上板町","ﾄｸｼﾏｹﾝ","ｶﾐｲﾀﾁｮｳ"]
["364681","徳島県","つるぎ町","ﾄｸｼﾏｹﾝ","ﾂﾙｷﾞﾁｮｳ"]
["364894","徳島県","東みよし町","ﾄｸｼﾏｹﾝ","ﾋｶﾞｼﾐﾖｼﾁｮｳ"]
["370002","香川県",null,"ｶｶﾞﾜｹﾝ"]
["372013","香川県","高松市","ｶｶﾞﾜｹﾝ","ﾀｶﾏﾂｼ"]
["372021","香川県","丸亀市","ｶｶﾞﾜｹﾝ","ﾏﾙｶﾞﾒｼ"]
["372030","香川県","坂出市","ｶｶﾞﾜｹﾝ","ｻｶｲﾃﾞｼ"]
["372048","香川県","善通寺市","ｶｶﾞﾜｹﾝ","ｾﾞﾝﾂｳｼﾞｼ"]
["372056","香川県","観音寺市","ｶｶﾞﾜｹﾝ","ｶﾝｵﾝｼﾞｼ"]
["372064","香川県","さぬき市","ｶｶﾞﾜｹﾝ","ｻﾇｷｼ"]
["372072","香川県","東かがわ市","ｶｶﾞﾜｹﾝ","ﾋｶﾞｼｶｶﾞﾜｼ"]
["372081","香川県","三豊市","ｶｶﾞﾜｹﾝ","ﾐﾄﾖｼ"]
["373222","香川県","土庄町","ｶｶﾞﾜｹﾝ","ﾄﾉｼｮｳﾁｮｳ"]
["373249","香川県","小豆島町","ｶｶﾞﾜｹﾝ","ｼｮｳﾄﾞｼﾏﾁｮｳ"]
["373419","香川県","三木町","ｶｶﾞﾜｹﾝ","ﾐｷﾁｮｳ"]
["373648","香川県","直島町","ｶｶﾞﾜｹﾝ","ﾅｵｼﾏﾁｮｳ"]
["373869","香川県","宇多津町","ｶｶﾞﾜｹﾝ","ｳﾀﾂﾞﾁｮｳ"]
["373877","香川県","綾川町","ｶｶﾞﾜｹﾝ","ｱﾔｶﾞﾜﾁｮｳ"]
["374032","香川県","琴平町","ｶｶﾞﾜｹﾝ","ｺﾄﾋﾗﾁｮｳ"]
["374041","香川県","多度津町","ｶｶﾞﾜｹﾝ","ﾀﾄﾞﾂﾁｮｳ"]
["374067","香川県","まんのう町","ｶｶﾞﾜｹﾝ","ﾏﾝﾉｳﾁｮｳ"]
["380008","愛媛県",null,"ｴﾋﾒｹﾝ"]
["382019","愛媛県","松山市","ｴﾋﾒｹﾝ","ﾏﾂﾔﾏｼ"]
["382027","愛媛県","今治市","ｴﾋﾒｹﾝ","ｲﾏﾊﾞﾘｼ"]
["382035","愛媛県","宇和島市","ｴﾋﾒｹﾝ","ｳﾜｼﾞﾏｼ"]
["382043","愛媛県","八幡浜市","ｴﾋﾒｹﾝ","ﾔﾜﾀﾊﾏｼ"]
["382051","愛媛県","新居浜市","ｴﾋﾒｹﾝ","ﾆｲﾊﾏｼ"]
["382060","愛媛県","西条市","ｴﾋﾒｹﾝ","ｻｲｼﾞｮｳｼ"]
["382078","愛媛県","大洲市","ｴﾋﾒｹﾝ","ｵｵｽﾞｼ"]
["382108","愛媛県","伊予市","ｴﾋﾒｹﾝ","ｲﾖｼ"]
["382132","愛媛県","四国中央市","ｴﾋﾒｹﾝ","ｼｺｸﾁｭｳｵｳｼ"]
["382141","愛媛県","西予市","ｴﾋﾒｹﾝ","ｾｲﾖｼ"]
["382159","愛媛県","東温市","ｴﾋﾒｹﾝ","ﾄｳｵﾝｼ"]
["383562","愛媛県","上島町","ｴﾋﾒｹﾝ","ｶﾐｼﾞﾏﾁｮｳ"]
["383864","愛媛県","久万高原町","ｴﾋﾒｹﾝ","ｸﾏｺｳｹﾞﾝﾁｮｳ"]
["384011","愛媛県","松前町","ｴﾋﾒｹﾝ","ﾏｻｷﾁｮｳ"]
["384020","愛媛県","砥部町","ｴﾋﾒｹﾝ","ﾄﾍﾞﾁｮｳ"]
["384224","愛媛県","内子町","ｴﾋﾒｹﾝ","ｳﾁｺﾁｮｳ"]
["384429","愛媛県","伊方町","ｴﾋﾒｹﾝ","ｲｶﾀﾁｮｳ"]
["384844","愛媛県","松野町","ｴﾋﾒｹﾝ","ﾏﾂﾉﾁｮｳ"]
["384887","愛媛県","鬼北町","ｴﾋﾒｹﾝ","ｷﾎｸﾁｮｳ"]
["385069","愛媛県","愛南町","ｴﾋﾒｹﾝ","ｱｲﾅﾝﾁｮｳ"]
["390003","高知県",null,"ｺｳﾁｹﾝ"]
["392014","高知県","高知市","ｺｳﾁｹﾝ","ｺｳﾁｼ"]
["392022","高知県","室戸市","ｺｳﾁｹﾝ","ﾑﾛﾄｼ"]
["392031","高知県","安芸市","ｺｳﾁｹﾝ","ｱｷｼ"]
["392049","高知県","南国市","ｺｳﾁｹﾝ","ﾅﾝｺｸｼ"]
["392057","高知県","土佐市","ｺｳﾁｹﾝ","ﾄｻｼ"]
["392065","高知県","須崎市","ｺｳﾁｹﾝ","ｽｻｷｼ"]
["392081","高知県","宿毛市","ｺｳﾁｹﾝ","ｽｸﾓｼ"]
["392090","高知県","土佐清水市","ｺｳﾁｹﾝ","ﾄｻｼﾐｽﾞｼ"]
["392103","高知県","四万十市","ｺｳﾁｹﾝ","ｼﾏﾝﾄｼ"]
["392111","高知県","香南市","ｺｳﾁｹﾝ","ｺｳﾅﾝｼ"]
["392120","高知県","香美市","ｺｳﾁｹﾝ","ｶﾐｼ"]
["393011","高知県","東洋町","ｺｳﾁｹﾝ","ﾄｳﾖｳﾁｮｳ"]
["393029","高知県","奈半利町","ｺｳﾁｹﾝ","ﾅﾊﾘﾁｮｳ"]
["393037","高知県","田野町","ｺｳﾁｹﾝ","ﾀﾉﾁｮｳ"]
["393045","高知県","安田町","ｺｳﾁｹﾝ","ﾔｽﾀﾞﾁｮｳ"]
["393053","高知県","北川村","ｺｳﾁｹﾝ","ｷﾀｶﾞﾜﾑﾗ"]
["393061","高知県","馬路村","ｺｳﾁｹﾝ","ｳﾏｼﾞﾑﾗ"]
["393070","高知県","芸西村","ｺｳﾁｹﾝ","ｹﾞｲｾｲﾑﾗ"]
["393410","高知県","本山町","ｺｳﾁｹﾝ","ﾓﾄﾔﾏﾁｮｳ"]
["393444","高知県","大豊町","ｺｳﾁｹﾝ","ｵｵﾄﾖﾁｮｳ"]
["393631","高知県","土佐町","ｺｳﾁｹﾝ","ﾄｻﾁｮｳ"]
["393649","高知県","大川村","ｺｳﾁｹﾝ","ｵｵｶﾜﾑﾗ"]
["393860","高知県","いの町","ｺｳﾁｹﾝ","ｲﾉﾁｮｳ"]
["393878","高知県","仁淀川町","ｺｳﾁｹﾝ","ﾆﾖﾄﾞｶﾞﾜﾁｮｳ"]
["394017","高知県","中土佐町","ｺｳﾁｹﾝ","ﾅｶﾄｻﾁｮｳ"]
["394025","高知県","佐川町","ｺｳﾁｹﾝ","ｻｶﾜﾁｮｳ"]
["394033","高知県","越知町","ｺｳﾁｹﾝ","ｵﾁﾁｮｳ"]
["394050","高知県","梼原町","ｺｳﾁｹﾝ","ﾕｽﾊﾗﾁｮｳ"]
["394106","高知県","日高村","ｺｳﾁｹﾝ","ﾋﾀﾞｶﾑﾗ"]
["394114","高知県","津野町","ｺｳﾁｹﾝ","ﾂﾉﾁｮｳ"]
["394122","高知県","四万十町","ｺｳﾁｹﾝ","ｼﾏﾝﾄﾁｮｳ"]
["394246","高知県","大月町","ｺｳﾁｹﾝ","ｵｵﾂｷﾁｮｳ"]
["394271","高知県","三原村","ｺｳﾁｹﾝ","ﾐﾊﾗﾑﾗ"]
["394289","高知県","黒潮町","ｺｳﾁｹﾝ","ｸﾛｼｵﾁｮｳ"]
["400009","福岡県",null,"ﾌｸｵｶｹﾝ"]
["401005","福岡県","北九州市","ﾌｸｵｶｹﾝ","ｷﾀｷｭｳｼｭｳｼ"]
["401307","福岡県","福岡市","ﾌｸｵｶｹﾝ","ﾌｸｵｶｼ"]
["402028","福岡県","大牟田市","ﾌｸｵｶｹﾝ","ｵｵﾑﾀｼ"]
["402036","福岡県","久留米市","ﾌｸｵｶｹﾝ","ｸﾙﾒｼ"]
["402044","福岡県","直方市","ﾌｸｵｶｹﾝ","ﾉｵｶﾞﾀｼ"]
["402052","福岡県","飯塚市","ﾌｸｵｶｹﾝ","ｲｲﾂﾞｶｼ"]
["402061","福岡県","田川市","ﾌｸｵｶｹﾝ","ﾀｶﾞﾜｼ"]
["402079","福岡県","柳川市","ﾌｸｵｶｹﾝ","ﾔﾅｶﾞﾜｼ"]
["402109","福岡県","八女市","ﾌｸｵｶｹﾝ","ﾔﾒｼ"]
["402117","福岡県","筑後市","ﾌｸｵｶｹﾝ","ﾁｸｺﾞｼ"]
["402125","福岡県","大川市","ﾌｸｵｶｹﾝ","ｵｵｶﾜｼ"]
["402133","福岡県","行橋市","ﾌｸｵｶｹﾝ","ﾕｸﾊｼｼ"]
["402141","福岡県","豊前市","ﾌｸｵｶｹﾝ","ﾌﾞｾﾞﾝｼ"]
["402150","福岡県","中間市","ﾌｸｵｶｹﾝ","ﾅｶﾏｼ"]
["402168","福岡県","小郡市","ﾌｸｵｶｹﾝ","ｵｺﾞｵﾘｼ"]
["402176","福岡県","筑紫野市","ﾌｸｵｶｹﾝ","ﾁｸｼﾉｼ"]
["402184","福岡県","春日市","ﾌｸｵｶｹﾝ","ｶｽｶﾞｼ"]
["402192","福岡県","大野城市","ﾌｸｵｶｹﾝ","ｵｵﾉｼﾞｮｳｼ"]
["402206","福岡県","宗像市","ﾌｸｵｶｹﾝ","ﾑﾅｶﾀｼ"]
["402214","福岡県","太宰府市","ﾌｸｵｶｹﾝ","ﾀﾞｻﾞｲﾌｼ"]
["402231","福岡県","古賀市","ﾌｸｵｶｹﾝ","ｺｶﾞｼ"]
["402249","福岡県","福津市","ﾌｸｵｶｹﾝ","ﾌｸﾂｼ"]
["402257","福岡県","うきは市","ﾌｸｵｶｹﾝ","ｳｷﾊｼ"]
["402265","福岡県","宮若市","ﾌｸｵｶｹﾝ","ﾐﾔﾜｶｼ"]
["402273","福岡県","嘉麻市","ﾌｸｵｶｹﾝ","ｶﾏｼ"]
["402281","福岡県","朝倉市","ﾌｸｵｶｹﾝ","ｱｻｸﾗｼ"]
["402290","福岡県","みやま市","ﾌｸｵｶｹﾝ","ﾐﾔﾏｼ"]
["402303","福岡県","糸島市","ﾌｸｵｶｹﾝ","ｲﾄｼﾏｼ"]
["402311","福岡県","那珂川市","ﾌｸｵｶｹﾝ","ﾅｶｶﾞﾜｼ"]
["403415","福岡県","宇美町","ﾌｸｵｶｹﾝ","ｳﾐﾏﾁ"]
["403423","福岡県","篠栗町","ﾌｸｵｶｹﾝ","ｻｻｸﾞﾘﾏﾁ"]
["403431","福岡県","志免町","ﾌｸｵｶｹﾝ","ｼﾒﾏﾁ"]
["403440","福岡県","須恵町","ﾌｸｵｶｹﾝ","ｽｴﾏﾁ"]
["403458","福岡県","新宮町","ﾌｸｵｶｹﾝ","ｼﾝｸﾞｳﾏﾁ"]
["403482","福岡県","久山町","ﾌｸｵｶｹﾝ","ﾋｻﾔﾏﾏﾁ"]
["403491","福岡県","粕屋町","ﾌｸｵｶｹﾝ","ｶｽﾔﾏﾁ"]
["403814","福岡県","芦屋町","ﾌｸｵｶｹﾝ","ｱｼﾔﾏﾁ"]
["403822","福岡県","水巻町","ﾌｸｵｶｹﾝ","ﾐｽﾞﾏｷﾏﾁ"]
["403831","福岡県","岡垣町","ﾌｸｵｶｹﾝ","ｵｶｶﾞｷﾏﾁ"]
["403849","福岡県","遠賀町","ﾌｸｵｶｹﾝ","ｵﾝｶﾞﾁｮｳ"]
["404012","福岡県","小竹町","ﾌｸｵｶｹﾝ","ｺﾀｹﾏﾁ"]
["404021","福岡県","鞍手町","ﾌｸｵｶｹﾝ","ｸﾗﾃﾏﾁ"]
["404217","福岡県","桂川町","ﾌｸｵｶｹﾝ","ｹｲｾﾝﾏﾁ"]
["404471","福岡県","筑前町","ﾌｸｵｶｹﾝ","ﾁｸｾﾞﾝﾏﾁ"]
["404489","福岡県","東峰村","ﾌｸｵｶｹﾝ","ﾄｳﾎｳﾑﾗ"]
["405035","福岡県","大刀洗町","ﾌｸｵｶｹﾝ","ﾀﾁｱﾗｲﾏﾁ"]
["405221","福岡県","大木町","ﾌｸｵｶｹﾝ","ｵｵｷﾏﾁ"]
["405442","福岡県","広川町","ﾌｸｵｶｹﾝ","ﾋﾛｶﾜﾏﾁ"]
["406015","福岡県","香春町","ﾌｸｵｶｹﾝ","ｶﾜﾗﾏﾁ"]
["406023","福岡県","添田町","ﾌｸｵｶｹﾝ","ｿｴﾀﾞﾏﾁ"]
["406040","福岡県","糸田町","ﾌｸｵｶｹﾝ","ｲﾄﾀﾞﾏﾁ"]
["406058","福岡県","川崎町","ﾌｸｵｶｹﾝ","ｶﾜｻｷﾏﾁ"]
["406082","福岡県","大任町","ﾌｸｵｶｹﾝ","ｵｵﾄｳﾏﾁ"]
["406091","福岡県","赤村","ﾌｸｵｶｹﾝ","ｱｶﾑﾗ"]
["406104","福岡県","福智町","ﾌｸｵｶｹﾝ","ﾌｸﾁﾏﾁ"]
["406210","福岡県","苅田町","ﾌｸｵｶｹﾝ","ｶﾝﾀﾞﾏﾁ"]
["406252","福岡県","みやこ町","ﾌｸｵｶｹﾝ","ﾐﾔｺﾏﾁ"]
["406422","福岡県","吉富町","ﾌｸｵｶｹﾝ","ﾖｼﾄﾐﾏﾁ"]
["406465","福岡県","上毛町","ﾌｸｵｶｹﾝ","ｺｳｹﾞﾏﾁ"]
["406473","福岡県","築上町","ﾌｸｵｶｹﾝ","ﾁｸｼﾞｮｳﾏﾁ"]
["410004","佐賀県",null,"ｻｶﾞｹﾝ"]
["412015","佐賀県","佐賀市","ｻｶﾞｹﾝ","ｻｶﾞｼ"]
["412023","佐賀県","唐津市","ｻｶﾞｹﾝ","ｶﾗﾂｼ"]
["412031","佐賀県","鳥栖市","ｻｶﾞｹﾝ","ﾄｽｼ"]
["412040","佐賀県","多久市","ｻｶﾞｹﾝ","ﾀｸｼ"]
["412058","佐賀県","伊万里市","ｻｶﾞｹﾝ","ｲﾏﾘｼ"]
["412066","佐賀県","武雄市","ｻｶﾞｹﾝ","ﾀｹｵｼ"]
["412074","佐賀県","鹿島市","ｻｶﾞｹﾝ","ｶｼﾏｼ"]
["412082","佐賀県","小城市","ｻｶﾞｹﾝ","ｵｷﾞｼ"]
["412091","佐賀県","嬉野市","ｻｶﾞｹﾝ","ｳﾚｼﾉｼ"]
["412104","佐賀県","神埼市","ｻｶﾞｹﾝ","ｶﾝｻﾞｷｼ"]
["413275","佐賀県","吉野ヶ里町","ｻｶﾞｹﾝ","ﾖｼﾉｶﾞﾘﾁｮｳ"]
["413411","佐賀県","基山町","ｻｶﾞｹﾝ","ｷﾔﾏﾁｮｳ"]
["413453","佐賀県","上峰町","ｻｶﾞｹﾝ","ｶﾐﾐﾈﾁｮｳ"]
["413461","佐賀県","みやき町","ｻｶﾞｹﾝ","ﾐﾔｷﾁｮｳ"]
["413879","佐賀県","玄海町","ｻｶﾞｹﾝ","ｹﾞﾝｶｲﾁｮｳ"]
["414018","佐賀県","有田町","ｻｶﾞｹﾝ","ｱﾘﾀﾁｮｳ"]
["414239","佐賀県","大町町","ｻｶﾞｹﾝ","ｵｵﾏﾁﾁｮｳ"]
["414247","佐賀県","江北町","ｻｶﾞｹﾝ","ｺｳﾎｸﾏﾁ"]
["414255","佐賀県","白石町","ｻｶﾞｹﾝ","ｼﾛｲｼﾁｮｳ"]
["414417","佐賀県","太良町","ｻｶﾞｹﾝ","ﾀﾗﾁｮｳ"]
["420000","長崎県",null,"ﾅｶﾞｻｷｹﾝ"]
["422011","長崎県","長崎市","ﾅｶﾞｻｷｹﾝ","ﾅｶﾞｻｷｼ"]
["422029","長崎県","佐世保市","ﾅｶﾞｻｷｹﾝ","ｻｾﾎﾞｼ"]
["422037","長崎県","島原市","ﾅｶﾞｻｷｹﾝ","ｼﾏﾊﾞﾗｼ"]
["422045","長崎県","諫早市","ﾅｶﾞｻｷｹﾝ","ｲｻﾊﾔｼ"]
["422053","長崎県","大村市","ﾅｶﾞｻｷｹﾝ","ｵｵﾑﾗｼ"]
["422070","長崎県","平戸市","ﾅｶﾞｻｷｹﾝ","ﾋﾗﾄﾞｼ"]
["422088","長崎県","松浦市","ﾅｶﾞｻｷｹﾝ","ﾏﾂｳﾗｼ"]
["422096","長崎県","対馬市","ﾅｶﾞｻｷｹﾝ","ﾂｼﾏｼ"]
["422100","長崎県","壱岐市","ﾅｶﾞｻｷｹﾝ","ｲｷｼ"]
["422118","長崎県","五島市","ﾅｶﾞｻｷｹﾝ","ｺﾞﾄｳｼ"]
["422126","長崎県","西海市","ﾅｶﾞｻｷｹﾝ","ｻｲｶｲｼ"]
["422134","長崎県","雲仙市","ﾅｶﾞｻｷｹﾝ","ｳﾝｾﾞﾝｼ"]
["422142","長崎県","南島原市","ﾅｶﾞｻｷｹﾝ","ﾐﾅﾐｼﾏﾊﾞﾗｼ"]
["423076","長崎県","長与町","ﾅｶﾞｻｷｹﾝ","ﾅｶﾞﾖﾁｮｳ"]
["423084","長崎県","時津町","ﾅｶﾞｻｷｹﾝ","ﾄｷﾞﾂﾁｮｳ"]
["423211","長崎県","東彼杵町","ﾅｶﾞｻｷｹﾝ","ﾋｶﾞｼｿﾉｷﾞﾁｮｳ"]
["423220","長崎県","川棚町","ﾅｶﾞｻｷｹﾝ","ｶﾜﾀﾅﾁｮｳ"]
["423238","長崎県","波佐見町","ﾅｶﾞｻｷｹﾝ","ﾊｻﾐﾁｮｳ"]
["423831","長崎県","小値賀町","ﾅｶﾞｻｷｹﾝ","ｵﾁﾞｶﾁｮｳ"]
["423912","長崎県","佐々町","ﾅｶﾞｻｷｹﾝ","ｻｻﾞﾁｮｳ"]
["424111","長崎県","新上五島町","ﾅｶﾞｻｷｹﾝ","ｼﾝｶﾐｺﾞﾄｳﾁｮｳ"]
["430005","熊本県",null,"ｸﾏﾓﾄｹﾝ"]
["431001","熊本県","熊本市","ｸﾏﾓﾄｹﾝ","ｸﾏﾓﾄｼ"]
["432024","熊本県","八代市","ｸﾏﾓﾄｹﾝ","ﾔﾂｼﾛｼ"]
["432032","熊本県","人吉市","ｸﾏﾓﾄｹﾝ","ﾋﾄﾖｼｼ"]
["432041","熊本県","荒尾市","ｸﾏﾓﾄｹﾝ","ｱﾗｵｼ"]
["432059","熊本県","水俣市","ｸﾏﾓﾄｹﾝ","ﾐﾅﾏﾀｼ"]
["432067","熊本県","玉名市","ｸﾏﾓﾄｹﾝ","ﾀﾏﾅｼ"]
["432083","熊本県","山鹿市","ｸﾏﾓﾄｹﾝ","ﾔﾏｶﾞｼ"]
["432105","熊本県","菊池市","ｸﾏﾓﾄｹﾝ","ｷｸﾁｼ"]
["432113","熊本県","宇土市","ｸﾏﾓﾄｹﾝ","ｳﾄｼ"]
["432121","熊本県","上天草市","ｸﾏﾓﾄｹﾝ","ｶﾐｱﾏｸｻｼ"]
["432130","熊本県","宇城市","ｸﾏﾓﾄｹﾝ","ｳｷｼ"]
["432148","熊本県","阿蘇市","ｸﾏﾓﾄｹﾝ","ｱｿｼ"]
["432156","熊本県","天草市","ｸﾏﾓﾄｹﾝ","ｱﾏｸｻｼ"]
["432164","熊本県","合志市","ｸﾏﾓﾄｹﾝ","ｺｳｼｼ"]
["433489","熊本県","美里町","ｸﾏﾓﾄｹﾝ","ﾐｻﾄﾏﾁ"]
["433641","熊本県","玉東町","ｸﾏﾓﾄｹﾝ","ｷﾞｮｸﾄｳﾏﾁ"]
["433675","熊本県","南関町","ｸﾏﾓﾄｹﾝ","ﾅﾝｶﾝﾏﾁ"]
["433683","熊本県","長洲町","ｸﾏﾓﾄｹﾝ","ﾅｶﾞｽﾏﾁ"]
["433691","熊本県","和水町","ｸﾏﾓﾄｹﾝ","ﾅｺﾞﾐﾏﾁ"]
["434035","熊本県","大津町","ｸﾏﾓﾄｹﾝ","ｵｵﾂﾞﾏﾁ"]
["434043","熊本県","菊陽町","ｸﾏﾓﾄｹﾝ","ｷｸﾖｳﾏﾁ"]
["434230","熊本県","南小国町","ｸﾏﾓﾄｹﾝ","ﾐﾅﾐｵｸﾞﾆﾏﾁ"]
["434248","熊本県","小国町","ｸﾏﾓﾄｹﾝ","ｵｸﾞﾆﾏﾁ"]
["434256","熊本県","産山村","ｸﾏﾓﾄｹﾝ","ｳﾌﾞﾔﾏﾑﾗ"]
["434281","熊本県","高森町","ｸﾏﾓﾄｹﾝ","ﾀｶﾓﾘﾏﾁ"]
["434329","熊本県","西原村","ｸﾏﾓﾄｹﾝ","ﾆｼﾊﾗﾑﾗ"]
["434337","熊本県","南阿蘇村","ｸﾏﾓﾄｹﾝ","ﾐﾅﾐｱｿﾑﾗ"]
["434418","熊本県","御船町","ｸﾏﾓﾄｹﾝ","ﾐﾌﾈﾏﾁ"]
["434426","熊本県","嘉島町","ｸﾏﾓﾄｹﾝ","ｶｼﾏﾏﾁ"]
["434434","熊本県","益城町","ｸﾏﾓﾄｹﾝ","ﾏｼｷﾏﾁ"]
["434442","熊本県","甲佐町","ｸﾏﾓﾄｹﾝ","ｺｳｻﾏﾁ"]
["434477","熊本県","山都町","ｸﾏﾓﾄｹﾝ","ﾔﾏﾄﾁｮｳ"]
["434680","熊本県","氷川町","ｸﾏﾓﾄｹﾝ","ﾋｶﾜﾁｮｳ"]
["434825","熊本県","芦北町","ｸﾏﾓﾄｹﾝ","ｱｼｷﾀﾏﾁ"]
["434841","熊本県","津奈木町","ｸﾏﾓﾄｹﾝ","ﾂﾅｷﾞﾏﾁ"]
["435015","熊本県","錦町","ｸﾏﾓﾄｹﾝ","ﾆｼｷﾏﾁ"]
["435058","熊本県","多良木町","ｸﾏﾓﾄｹﾝ","ﾀﾗｷﾞﾏﾁ"]
["435066","熊本県","湯前町","ｸﾏﾓﾄｹﾝ","ﾕﾉﾏｴﾏﾁ"]
["435074","熊本県","水上村","ｸﾏﾓﾄｹﾝ","ﾐｽﾞｶﾐﾑﾗ"]
["435104","熊本県","相良村","ｸﾏﾓﾄｹﾝ","ｻｶﾞﾗﾑﾗ"]
["435112","熊本県","五木村","ｸﾏﾓﾄｹﾝ","ｲﾂｷﾑﾗ"]
["435121","熊本県","山江村","ｸﾏﾓﾄｹﾝ","ﾔﾏｴﾑﾗ"]
["435139","熊本県","球磨村","ｸﾏﾓﾄｹﾝ","ｸﾏﾑﾗ"]
["435147","熊本県","あさぎり町","ｸﾏﾓﾄｹﾝ","ｱｻｷﾞﾘﾁｮｳ"]
["435317","熊本県","苓北町","ｸﾏﾓﾄｹﾝ","ﾚｲﾎｸﾏﾁ"]
["440001","大分県",null,"ｵｵｲﾀｹﾝ"]
["442011","大分県","大分市","ｵｵｲﾀｹﾝ","ｵｵｲﾀｼ"]
["442020","大分県","別府市","ｵｵｲﾀｹﾝ","ﾍﾞｯﾌﾟｼ"]
["442038","大分県","中津市","ｵｵｲﾀｹﾝ","ﾅｶﾂｼ"]
["442046","大分県","日田市","ｵｵｲﾀｹﾝ","ﾋﾀｼ"]
["442054","大分県","佐伯市","ｵｵｲﾀｹﾝ","ｻｲｷｼ"]
["442062","大分県","臼杵市","ｵｵｲﾀｹﾝ","ｳｽｷｼ"]
["442071","大分県","津久見市","ｵｵｲﾀｹﾝ","ﾂｸﾐｼ"]
["442089","大分県","竹田市","ｵｵｲﾀｹﾝ","ﾀｹﾀｼ"]
["442097","大分県","豊後高田市","ｵｵｲﾀｹﾝ","ﾌﾞﾝｺﾞﾀｶﾀﾞｼ"]
["442101","大分県","杵築市","ｵｵｲﾀｹﾝ","ｷﾂｷｼ"]
["442119","大分県","宇佐市","ｵｵｲﾀｹﾝ","ｳｻｼ"]
["442127","大分県","豊後大野市","ｵｵｲﾀｹﾝ","ﾌﾞﾝｺﾞｵｵﾉｼ"]
["442135","大分県","由布市","ｵｵｲﾀｹﾝ","ﾕﾌｼ"]
["442143","大分県","国東市","ｵｵｲﾀｹﾝ","ｸﾆｻｷｼ"]
["443221","大分県","姫島村","ｵｵｲﾀｹﾝ","ﾋﾒｼﾏﾑﾗ"]
["443417","大分県","日出町","ｵｵｲﾀｹﾝ","ﾋｼﾞﾏﾁ"]
["444618","大分県","九重町","ｵｵｲﾀｹﾝ","ｺｺﾉｴﾏﾁ"]
["444626","大分県","玖珠町","ｵｵｲﾀｹﾝ","ｸｽﾏﾁ"]
["450006","宮崎県",null,"ﾐﾔｻﾞｷｹﾝ"]
["452017","宮崎県","宮崎市","ﾐﾔｻﾞｷｹﾝ","ﾐﾔｻﾞｷｼ"]
["452025","宮崎県","都城市","ﾐﾔｻﾞｷｹﾝ","ﾐﾔｺﾉｼﾞｮｳｼ"]
["452033","宮崎県","延岡市","ﾐﾔｻﾞｷｹﾝ","ﾉﾍﾞｵｶｼ"]
["452041","宮崎県","日南市","ﾐﾔｻﾞｷｹﾝ","ﾆﾁﾅﾝｼ"]
["452050","宮崎県","小林市","ﾐﾔｻﾞｷｹﾝ","ｺﾊﾞﾔｼｼ"]
["452068","宮崎県","日向市","ﾐﾔｻﾞｷｹﾝ","ﾋｭｳｶﾞｼ"]
["452076","宮崎県","串間市","ﾐﾔｻﾞｷｹﾝ","ｸｼﾏｼ"]
["452084","宮崎県","西都市","ﾐﾔｻﾞｷｹﾝ","ｻｲﾄｼ"]
["452092","宮崎県","えびの市","ﾐﾔｻﾞｷｹﾝ","ｴﾋﾞﾉｼ"]
["453412","宮崎県","三股町","ﾐﾔｻﾞｷｹﾝ","ﾐﾏﾀﾁｮｳ"]
["453617","宮崎県","高原町","ﾐﾔｻﾞｷｹﾝ","ﾀｶﾊﾙﾁｮｳ"]
["453820","宮崎県","国富町","ﾐﾔｻﾞｷｹﾝ","ｸﾆﾄﾐﾁｮｳ"]
["453838","宮崎県","綾町","ﾐﾔｻﾞｷｹﾝ","ｱﾔﾁｮｳ"]
["454010","宮崎県","高鍋町","ﾐﾔｻﾞｷｹﾝ","ﾀｶﾅﾍﾞﾁｮｳ"]
["454028","宮崎県","新富町","ﾐﾔｻﾞｷｹﾝ","ｼﾝﾄﾐﾁｮｳ"]
["454036","宮崎県","西米良村","ﾐﾔｻﾞｷｹﾝ","ﾆｼﾒﾗｿﾝ"]
["454044","宮崎県","木城町","ﾐﾔｻﾞｷｹﾝ","ｷｼﾞｮｳﾁｮｳ"]
["454052","宮崎県","川南町","ﾐﾔｻﾞｷｹﾝ","ｶﾜﾐﾅﾐﾁｮｳ"]
["454061","宮崎県","都農町","ﾐﾔｻﾞｷｹﾝ","ﾂﾉﾁｮｳ"]
["454214","宮崎県","門川町","ﾐﾔｻﾞｷｹﾝ","ｶﾄﾞｶﾞﾜﾁｮｳ"]
["454290","宮崎県","諸塚村","ﾐﾔｻﾞｷｹﾝ","ﾓﾛﾂｶｿﾝ"]
["454303","宮崎県","椎葉村","ﾐﾔｻﾞｷｹﾝ","ｼｲﾊﾞｿﾝ"]
["454311","宮崎県","美郷町","ﾐﾔｻﾞｷｹﾝ","ﾐｻﾄﾁｮｳ"]
["454419","宮崎県","高千穂町","ﾐﾔｻﾞｷｹﾝ","ﾀｶﾁﾎﾁｮｳ"]
["454427","宮崎県","日之影町","ﾐﾔｻﾞｷｹﾝ","ﾋﾉｶｹﾞﾁｮｳ"]
["454435","宮崎県","五ヶ瀬町","ﾐﾔｻﾞｷｹﾝ","ｺﾞｶｾﾁｮｳ"]
["460001","鹿児島県",null,"ｶｺﾞｼﾏｹﾝ"]
["462012","鹿児島県","鹿児島市","ｶｺﾞｼﾏｹﾝ","ｶｺﾞｼﾏｼ"]
["462039","鹿児島県","鹿屋市","ｶｺﾞｼﾏｹﾝ","ｶﾉﾔｼ"]
["462047","鹿児島県","枕崎市","ｶｺﾞｼﾏｹﾝ","ﾏｸﾗｻﾞｷｼ"]
["462063","鹿児島県","阿久根市","ｶｺﾞｼﾏｹﾝ","ｱｸﾈｼ"]
["462080","鹿児島県","出水市","ｶｺﾞｼﾏｹﾝ","ｲｽﾞﾐｼ"]
["462101","鹿児島県","指宿市","ｶｺﾞｼﾏｹﾝ","ｲﾌﾞｽｷｼ"]
["462136","鹿児島県","西之表市","ｶｺﾞｼﾏｹﾝ","ﾆｼﾉｵﾓﾃｼ"]
["462144","鹿児島県","垂水市","ｶｺﾞｼﾏｹﾝ","ﾀﾙﾐｽﾞｼ"]
["462152","鹿児島県","薩摩川内市","ｶｺﾞｼﾏｹﾝ","ｻﾂﾏｾﾝﾀﾞｲｼ"]
["462161","鹿児島県","日置市","ｶｺﾞｼﾏｹﾝ","ﾋｵｷｼ"]
["462179","鹿児島県","曽於市","ｶｺﾞｼﾏｹﾝ","ｿｵｼ"]
["462187","鹿児島県","霧島市","ｶｺﾞｼﾏｹﾝ","ｷﾘｼﾏｼ"]
["462195","鹿児島県","いちき串木野市","ｶｺﾞｼﾏｹﾝ","ｲﾁｷｸｼｷﾉｼ"]
["462209","鹿児島県","南さつま市","ｶｺﾞｼﾏｹﾝ","ﾐﾅﾐｻﾂﾏｼ"]
["462217","鹿児島県","志布志市","ｶｺﾞｼﾏｹﾝ","ｼﾌﾞｼｼ"]
["462225","鹿児島県","奄美市","ｶｺﾞｼﾏｹﾝ","ｱﾏﾐｼ"]
["462233","鹿児島県","南九州市","ｶｺﾞｼﾏｹﾝ","ﾐﾅﾐｷｭｳｼｭｳｼ"]
["462241","鹿児島県","伊佐市","ｶｺﾞｼﾏｹﾝ","ｲｻｼ"]
["462250","鹿児島県","姶良市","ｶｺﾞｼﾏｹﾝ","ｱｲﾗｼ"]
["463035","鹿児島県","三島村","ｶｺﾞｼﾏｹﾝ","ﾐｼﾏﾑﾗ"]
["463043","鹿児島県","十島村","ｶｺﾞｼﾏｹﾝ","ﾄｼﾏﾑﾗ"]
["463922","鹿児島県","さつま町","ｶｺﾞｼﾏｹﾝ","ｻﾂﾏﾁｮｳ"]
["464040","鹿児島県","長島町","ｶｺﾞｼﾏｹﾝ","ﾅｶﾞｼﾏﾁｮｳ"]
["464520","鹿児島県","湧水町","ｶｺﾞｼﾏｹﾝ","ﾕｳｽｲﾁｮｳ"]
["464686","鹿児島県","大崎町","ｶｺﾞｼﾏｹﾝ","ｵｵｻｷﾁｮｳ"]
["464821","鹿児島県","東串良町","ｶｺﾞｼﾏｹﾝ","ﾋｶﾞｼｸｼﾗﾁｮｳ"]
["464902","鹿児島県","錦江町","ｶｺﾞｼﾏｹﾝ","ｷﾝｺｳﾁｮｳ"]
["464911","鹿児島県","南大隅町","ｶｺﾞｼﾏｹﾝ","ﾐﾅﾐｵｵｽﾐﾁｮｳ"]
["464929","鹿児島県","肝付町","ｶｺﾞｼﾏｹﾝ","ｷﾓﾂｷﾁｮｳ"]
["465011","鹿児島県","中種子町","ｶｺﾞｼﾏｹﾝ","ﾅｶﾀﾈﾁｮｳ"]
["465020","鹿児島県","南種子町","ｶｺﾞｼﾏｹﾝ","ﾐﾅﾐﾀﾈﾁｮｳ"]
["465054","鹿児島県","屋久島町","ｶｺﾞｼﾏｹﾝ","ﾔｸｼﾏﾁｮｳ"]
["465232","鹿児島県","大和村","ｶｺﾞｼﾏｹﾝ","ﾔﾏﾄｿﾝ"]
["465241","鹿児島県","宇検村","ｶｺﾞｼﾏｹﾝ","ｳｹﾝｿﾝ"]
["465259","鹿児島県","瀬戸内町","ｶｺﾞｼﾏｹﾝ","ｾﾄｳﾁﾁｮｳ"]
["465275","鹿児島県","龍郷町","ｶｺﾞｼﾏｹﾝ","ﾀﾂｺﾞｳﾁｮｳ"]
["465291","鹿児島県","喜界町","ｶｺﾞｼﾏｹﾝ","ｷｶｲﾁｮｳ"]
["465305","鹿児島県","徳之島町","ｶｺﾞｼﾏｹﾝ","ﾄｸﾉｼﾏﾁｮｳ"]
["465313","鹿児島県","天城町","ｶｺﾞｼﾏｹﾝ","ｱﾏｷﾞﾁｮｳ"]
["465321","鹿児島県","伊仙町","ｶｺﾞｼﾏｹﾝ","ｲｾﾝﾁｮｳ"]
["465330","鹿児島県","和泊町","ｶｺﾞｼﾏｹﾝ","ﾜﾄﾞﾏﾘﾁｮｳ"]
["465348","鹿児島県","知名町","ｶｺﾞｼﾏｹﾝ","ﾁﾅﾁｮｳ"]
["465356","鹿児島県","与論町","ｶｺﾞｼﾏｹﾝ","ﾖﾛﾝﾁｮｳ"]
["470007","沖縄県",null,"ｵｷﾅﾜｹﾝ"]
["472018","沖縄県","那覇市","ｵｷﾅﾜｹﾝ","ﾅﾊｼ"]
["472051","沖縄県","宜野湾市","ｵｷﾅﾜｹﾝ","ｷﾞﾉﾜﾝｼ"]
["472077","沖縄県","石垣市","ｵｷﾅﾜｹﾝ","ｲｼｶﾞｷｼ"]
["472085","沖縄県","浦添市","ｵｷﾅﾜｹﾝ","ｳﾗｿｴｼ"]
["472093","沖縄県","名護市","ｵｷﾅﾜｹﾝ","ﾅｺﾞｼ"]
["472107","沖縄県","糸満市","ｵｷﾅﾜｹﾝ","ｲﾄﾏﾝｼ"]
["472115","沖縄県","沖縄市","ｵｷﾅﾜｹﾝ","ｵｷﾅﾜｼ"]
["472123","沖縄県","豊見城市","ｵｷﾅﾜｹﾝ","ﾄﾐｸﾞｽｸｼ"]
["472131","沖縄県","うるま市","ｵｷﾅﾜｹﾝ","ｳﾙﾏｼ"]
["472140","沖縄県","宮古島市","ｵｷﾅﾜｹﾝ","ﾐﾔｺｼﾞﾏｼ"]
["472158","沖縄県","南城市","ｵｷﾅﾜｹﾝ","ﾅﾝｼﾞｮｳｼ"]
["473014","沖縄県","国頭村","ｵｷﾅﾜｹﾝ","ｸﾆｶﾞﾐｿﾝ"]
["473022","沖縄県","大宜味村","ｵｷﾅﾜｹﾝ","ｵｵｷﾞﾐｿﾝ"]
["473031","沖縄県","東村","ｵｷﾅﾜｹﾝ","ﾋｶﾞｼｿﾝ"]
["473065","沖縄県","今帰仁村","ｵｷﾅﾜｹﾝ","ﾅｷｼﾞﾝｿﾝ"]
["473081","沖縄県","本部町","ｵｷﾅﾜｹﾝ","ﾓﾄﾌﾞﾁｮｳ"]
["473111","沖縄県","恩納村","ｵｷﾅﾜｹﾝ","ｵﾝﾅｿﾝ"]
["473138","沖縄県","宜野座村","ｵｷﾅﾜｹﾝ","ｷﾞﾉｻﾞｿﾝ"]
["473146","沖縄県","金武町","ｵｷﾅﾜｹﾝ","ｷﾝﾁｮｳ"]
["473154","沖縄県","伊江村","ｵｷﾅﾜｹﾝ","ｲｴｿﾝ"]
["473243","沖縄県","読谷村","ｵｷﾅﾜｹﾝ","ﾖﾐﾀﾝｿﾝ"]
["473251","沖縄県","嘉手納町","ｵｷﾅﾜｹﾝ","ｶﾃﾞﾅﾁｮｳ"]
["473260","沖縄県","北谷町","ｵｷﾅﾜｹﾝ","ﾁﾔﾀﾝﾁｮｳ"]
["473278","沖縄県","北中城村","ｵｷﾅﾜｹﾝ","ｷﾀﾅｶｸﾞｽｸｿﾝ"]
["473286","沖縄県","中城村","ｵｷﾅﾜｹﾝ","ﾅｶｸﾞｽｸｿﾝ"]
["473294","沖縄県","西原町","ｵｷﾅﾜｹﾝ","ﾆｼﾊﾗﾁｮｳ"]
["473481","沖縄県","与那原町","ｵｷﾅﾜｹﾝ","ﾖﾅﾊﾞﾙﾁｮｳ"]
["473502","沖縄県","南風原町","ｵｷﾅﾜｹﾝ","ﾊｴﾊﾞﾙﾁｮｳ"]
["473537","沖縄県","渡嘉敷村","ｵｷﾅﾜｹﾝ","ﾄｶｼｷｿﾝ"]
["473545","沖縄県","座間味村","ｵｷﾅﾜｹﾝ","ｻﾞﾏﾐｿﾝ"]
["473553","沖縄県","粟国村","ｵｷﾅﾜｹﾝ","ｱｸﾞﾆｿﾝ"]
["473561","沖縄県","渡名喜村","ｵｷﾅﾜｹﾝ","ﾄﾅｷｿﾝ"]
["473570","沖縄県","南大東村","ｵｷﾅﾜｹﾝ","ﾐﾅﾐﾀﾞｲﾄｳｿﾝ"]
["473588","沖縄県","北大東村","ｵｷﾅﾜｹﾝ","ｷﾀﾀﾞｲﾄｳｿﾝ"]
["473596","沖縄県","伊平屋村","ｵｷﾅﾜｹﾝ","ｲﾍﾔｿﾝ"]
["473600","沖縄県","伊是名村","ｵｷﾅﾜｹﾝ","ｲｾﾞﾅｿﾝ"]
["473618","沖縄県","久米島町","ｵｷﾅﾜｹﾝ","ｸﾒｼﾞﾏﾁｮｳ"]
["473626","沖縄県","八重瀬町","ｵｷﾅﾜｹﾝ","ﾔｴｾﾁｮｳ"]
["473758","沖縄県","多良間村","ｵｷﾅﾜｹﾝ","ﾀﾗﾏｿﾝ"]
["473812","沖縄県","竹富町","ｵｷﾅﾜｹﾝ","ﾀｹﾄﾐﾁｮｳ"]
["473821","沖縄県","与那国町","ｵｷﾅﾜｹﾝ","ﾖﾅｸﾞﾆﾁｮｳ"]

{"sheet":"補助率判定","index":8,"n_rows":1789,"n_cols":22,"rows_kept":1789,"cut":false,"hidden":true,"merged":[[7,10,8,22]]}
["分類","団体コード","都道府県名","団体名","財政力指数","財政力指数(統一)","補助率一時判定","特定団体コード判定","補助率判定"]
["都道府県","010006","北海道",null,46275,{"$f":"IF(A2=\"都道府県\",E2/100000,IF(A2=\"市区町村\",E2/100,\"エラー\"))","v":0.46274999999999999},{"$f":"IF(F2<>\"エラー\",IF(F2>=$N$16, 1, IF(F2<=$N$18, 3, 2)),\"エラー\")","v":2},{"$f":"IF(_xlfn.IFNA(VLOOKUP(B2,$T:$T,1,0),\"\")=\"\",\"\",\"〇\")","v":""},{"$f":"IF(H2=\"〇\",1,G2)","v":2}]
["都道府県","020001","青森県",null,36141,{"$f":"IF(A3=\"都道府県\",E3/100000,IF(A3=\"市区町村\",E3/100,\"エラー\"))","v":0.36141000000000001},{"$f":"IF(F3<>\"エラー\",IF(F3>=$N$16, 1, IF(F3<=$N$18, 3, 2)),\"エラー\")","v":2},"",{"$f":"IF(H3=\"〇\",1,G3)","v":2}]
["都道府県","030007","岩手県",null,36343,0.36342999999999998,2,"",2]
["都道府県","040002","宮城県",null,60728,{"$f":"IF(A5=\"都道府県\",E5/100000,IF(A5=\"市区町村\",E5/100,\"エラー\"))","v":0.60728000000000004},2,"",2]
["都道府県","050008","秋田県",null,32741,0.32740999999999998,2,"",2]
["都道府県","060003","山形県",null,37417,{"$f":"IF(A7=\"都道府県\",E7/100000,IF(A7=\"市区町村\",E7/100,\"エラー\"))","v":0.37417},2,"",2]
["都道府県","070009","福島県",null,51927,0.51927000000000001,2,"",2,null,"令和8年度用 補助率の変動パターン設定"]
["都道府県","080004","茨城県",null,63608,0.63607999999999998,2,"",2]
["都道府県","090000","栃木県",null,61911,0.61911000000000005,2,"",2,null,null,null,null,null,null,null,null,null,null,"特定団体コード"]
["都道府県","100005","群馬県",null,61000,0.61,2,"",2]
["都道府県","110001","埼玉県",null,74307,0.74307000000000001,2,"",2,null,null,"・ 特定団体コード一覧に存在する場合",null,null,null,"→ パターン1",null,null,null,"団体コード","都道府県名","団体名"]
["都道府県","120006","千葉県",null,75137,0.75136999999999998,2,"",2]
["都道府県","130001","東京都",null,121132,1.21132,1,"",1,null,null,"上記以外"]
["都道府県","140007","神奈川県",null,86325,0.86324999999999996,2,"",2]
["都道府県","150002","新潟県",null,46842,0.46842,2,"",2,null,null,"・ 財政力指数",null,1,"以上","→ パターン1"]
["都道府県","160008","富山県",null,46593,0.46593000000000001,2,"",2,null,null,"・ 通常",null,null,null,"→ パターン2"]
["都道府県","170003","石川県",null,49769,0.49769000000000002,2,"",2,null,null,"・ 財政力指数",null,0,"以下","→ パターン3"]
["都道府県","180009","福井県",null,42101,0.42101,2,"",2]
["都道府県","190004","山梨県",null,40292,0.40292,2,"",2]
["都道府県","200000","長野県",null,52667,0.52666999999999997,2,"",2]
["都道府県","210005","岐阜県",null,53775,0.53774999999999995,2,"",2]
["都道府県","220001","静岡県",null,68341,0.68340999999999996,2,"",2]
["都道府県","230006","愛知県",null,87787,0.87787000000000004,2,"",2]
["都道府県","240001","三重県",null,57393,0.57393000000000005,2,"",2]
["都道府県","250007","滋賀県",null,54888,0.54888000000000003,2,"",2]
["都道府県","260002","京都府",null,58058,0.58057999999999998,2,"",2]
["都道府県","270008","大阪府",null,75388,0.75387999999999999,2,"",2]
["都道府県","280003","兵庫県",null,62169,0.62168999999999996,2,"",2]
["都道府県","290009","奈良県",null,41554,0.41554000000000002,2,"",2]
["都道府県","300004","和歌山県",null,32913,0.32912999999999998,2,"",2]
["都道府県","310000","鳥取県",null,28178,0.28177999999999997,2,"",2]
["都道府県","320005","島根県",null,27455,0.27455000000000002,2,"",2]
["都道府県","330001","岡山県",null,52853,0.52853000000000006,2,"",2]
["都道府県","340006","広島県",null,60229,0.60228999999999999,2,"",2]
["都道府県","350001","山口県",null,45134,0.45134000000000002,2,"",2]
["都道府県","360007","徳島県",null,33554,0.33554,2,"",2]
["都道府県","370002","香川県",null,45890,0.45889999999999997,2,"",2]
["都道府県","380008","愛媛県",null,44758,0.44757999999999998,2,"",2]
["都道府県","390003","高知県",null,27477,0.27477000000000001,2,"",2]
["都道府県","400009","福岡県",null,63618,0.63617999999999997,2,"",2]
["都道府県","410004","佐賀県",null,36078,0.36077999999999999,2,"",2]
["都道府県","420000","長崎県",null,34583,0.34583000000000003,2,"",2]
["都道府県","430005","熊本県",null,42277,0.42276999999999998,2,"",2]
["都道府県","440001","大分県",null,39115,0.39115,2,"",2]
["都道府県","450006","宮崎県",null,36028,0.36027999999999999,2,"",2]
["都道府県","460001","鹿児島県",null,35726,0.35726000000000002,2,"",2]
["都道府県","470007","沖縄県",null,38002,0.38002000000000002,2,"",2]
["市区町村","011002","北海道","札幌市",70,0.7,2,"",2]
["市区町村","012025","北海道","函館市",48,0.48,2,"",2]
["市区町村","012033","北海道","小樽市",47,0.47,2,"",2]
["市区町村","012041","北海道","旭川市",53,{"$f":"IF(A52=\"都道府県\",E52/100000,IF(A52=\"市区町村\",E52/100,\"エラー\"))","v":0.53},2,"",2]
["市区町村","012050","北海道","室蘭市",62,0.62,2,"",2]
["市区町村","012068","北海道","釧路市",45,0.45,2,"",2]
["市区町村","012076","北海道","帯広市",60,0.6,2,"",2]
["市区町村","012084","北海道","北見市",44,0.44,2,"",2]
["市区町村","012092","北海道","夕張市",19,0.19,2,"",2]
["市区町村","012106","北海道","岩見沢市",38,0.38,2,"",2]
["市区町村","012114","北海道","網走市",45,0.45,2,"",2]
["市区町村","012122","北海道","留萌市",32,0.32,2,"",2]
["市区町村","012131","北海道","苫小牧市",75,0.75,2,"",2]
["市区町村","012149","北海道","稚内市",40,0.4,2,"",2]
["市区町村","012157","北海道","美唄市",26,0.26,2,"",2]
["市区町村","012165","北海道","芦別市",25,0.25,2,"",2]
["市区町村","012173","北海道","江別市",52,0.52,2,"",2]
["市区町村","012181","北海道","赤平市",18,0.18,2,{"$f":"IF(_xlfn.IFNA(VLOOKUP(B66,$T:$T,1,0),\"\")=\"\",\"\",\"〇\")","v":""},2]
["市区町村","012190","北海道","紋別市",34,0.34,{"$f":"IF(F67<>\"エラー\",IF(F67>=$N$16, 1, IF(F67<=$N$18, 3, 2)),\"エラー\")","v":2},"",{"$f":"IF(H67=\"〇\",1,G67)","v":2}]
["市区町村","012203","北海道","士別市",25,0.25,2,"",2]
["市区町村","012211","北海道","名寄市",27,0.27,2,"",2]
["市区町村","012220","北海道","三笠市",19,0.19,2,"",2]
["市区町村","012238","北海道","根室市",34,0.34,2,"",2]
["市区町村","012246","北海道","千歳市",71,0.71,2,"",2]
["市区町村","012254","北海道","滝川市",39,0.39,2,"",2]
["市区町村","012262","北海道","砂川市",30,0.3,2,"",2]
["市区町村","012271","北海道","歌志内市",11,0.11,2,"",2]
["市区町村","012289","北海道","深川市",26,0.26,2,"",2]
["市区町村","012297","北海道","富良野市",36,0.36,2,"",2]
["市区町村","012301","北海道","登別市",47,0.47,2,"",2]
["市区町村","012319","北海道","恵庭市",59,0.59,2,"",2]
["市区町村","012335","北海道","伊達市",38,0.38,2,"",2]
["市区町村","012343","北海道","北広島市",62,0.62,2,"",2]
["市区町村","012351","北海道","石狩市",55,0.55000000000000004,2,"",2]
["市区町村","012360","北海道","北斗市",48,0.48,2,"",2]
["市区町村","013030","北海道","当別町",37,0.37,2,"",2]
["市区町村","013048","北海道","新篠津村",18,0.18,2,"",2]
["市区町村","013315","北海道","松前町",18,0.18,2,"",2]
["市区町村","013323","北海道","福島町",21,0.21,2,"",2]
["市区町村","013331","北海道","知内町",27,0.27,2,"",2]
["市区町村","013340","北海道","木古内町",20,0.2,2,"",2]
["市区町村","013374","北海道","七飯町",45,0.45,2,"",2]
["市区町村","013439","北海道","鹿部町",23,0.23,2,"",2]
["市区町村","013455","北海道","森町",32,0.32,2,"",2]
["市区町村","013463","北海道","八雲町",30,0.3,2,"",2]
["市区町村","013471","北海道","長万部町",23,0.23,2,"",2]
["市区町村","013617","北海道","江差町",25,0.25,2,"",2]
["市区町村","013625","北海道","上ノ国町",16,0.16,2,"",2]
["市区町村","013633","北海道","厚沢部町",16,0.16,2,"",2]
["市区町村","013641","北海道","乙部町",14,0.14000000000000001,2,"",2]
["市区町村","013676","北海道","奥尻町",13,0.13,2,"",2]
["市区町村","013706","北海道","今金町",19,0.19,2,"",2]
["市区町村","013714","北海道","せたな町",17,0.17,2,"",2]
["市区町村","013919","北海道","島牧村",8,0.08,2,"",2]
["市区町村","013927","北海道","寿都町",15,0.15,2,"",2]
["市区町村","013935","北海道","黒松内町",14,0.14000000000000001,2,"",2]
["市区町村","013943","北海道","蘭越町",19,0.19,2,"",2]
["市区町村","013951","北海道","ニセコ町",30,0.3,2,"",2]
["市区町村","013960","北海道","真狩村",16,0.16,2,"",2]
["市区町村","013978","北海道","留寿都村",25,0.25,2,"",2]
["市区町村","013986","北海道","喜茂別町",18,0.18,2,"",2]
["市区町村","013994","北海道","京極町",59,0.59,2,"",2]
["市区町村","014001","北海道","倶知安町",70,0.7,2,"",2]
["市区町村","014010","北海道","共和町",23,0.23,2,"",2]
["市区町村","014028","北海道","岩内町",30,0.3,2,"",2]
["市区町村","014036","北海道","泊村",139,1.39,1,"",1]
["市区町村","014044","北海道","神恵内村",10,0.1,2,"",2]
["市区町村","014052","北海道","積丹町",11,{"$f":"IF(A116=\"都道府県\",E116/100000,IF(A116=\"市区町村\",E116/100,\"エラー\"))","v":0.11},2,"",2]
["市区町村","014061","北海道","古平町",12,0.12,2,"",2]
["市区町村","014079","北海道","仁木町",17,0.17,2,"",2]
["市区町村","014087","北海道","余市町",34,0.34,2,"",2]
["市区町村","014095","北海道","赤井川村",24,0.24,2,"",2]
["市区町村","014231","北海道","南幌町",28,0.28000000000000003,2,"",2]
["市区町村","014249","北海道","奈井江町",24,0.24,2,"",2]
["市区町村","014257","北海道","上砂川町",11,0.11,2,"",2]
["市区町村","014273","北海道","由仁町",22,0.22,2,"",2]
["市区町村","014281","北海道","長沼町",30,0.3,2,"",2]
["市区町村","014290","北海道","栗山町",29,0.28999999999999998,2,"",2]
["市区町村","014303","北海道","月形町",15,0.15,2,"",2]
["市区町村","014311","北海道","浦臼町",14,0.14000000000000001,2,"",2]
["市区町村","014320","北海道","新十津川町",18,0.18,2,"",2]
["市区町村","014338","北海道","妹背牛町",16,0.16,2,{"$f":"IF(_xlfn.IFNA(VLOOKUP(B130,$T:$T,1,0),\"\")=\"\",\"\",\"〇\")","v":""},2]
["市区町村","014346","北海道","秩父別町",15,0.15,{"$f":"IF(F131<>\"エラー\",IF(F131>=$N$16, 1, IF(F131<=$N$18, 3, 2)),\"エラー\")","v":2},"",{"$f":"IF(H131=\"〇\",1,G131)","v":2}]
["市区町村","014362","北海道","雨竜町",15,0.15,2,"",2]
["市区町村","014371","北海道","北竜町",12,0.12,2,"",2]
["市区町村","014389","北海道","沼田町",15,0.15,2,"",2]
["市区町村","014524","北海道","鷹栖町",27,0.27,2,"",2]
["市区町村","014532","北海道","東神楽町",36,0.36,2,"",2]
["市区町村","014541","北海道","当麻町",20,0.2,2,"",2]
["市区町村","014559","北海道","比布町",17,0.17,2,"",2]
["市区町村","014567","北海道","愛別町",15,0.15,2,"",2]
["市区町村","014575","北海道","上川町",15,0.15,2,"",2]
["市区町村","014583","北海道","東川町",24,0.24,2,"",2]
["市区町村","014591","北海道","美瑛町",22,0.22,2,"",2]
["市区町村","014605","北海道","上富良野町",30,0.3,2,"",2]
["市区町村","014613","北海道","中富良野町",22,0.22,2,"",2]
["市区町村","014621","北海道","南富良野町",13,0.13,2,"",2]
["市区町村","014630","北海道","占冠村",26,0.26,2,"",2]
["市区町村","014648","北海道","和寒町",16,0.16,2,"",2]
["市区町村","014656","北海道","剣淵町",15,0.15,2,"",2]
["市区町村","014681","北海道","下川町",15,0.15,2,"",2]
["市区町村","014699","北海道","美深町",15,0.15,2,"",2]
["市区町村","014702","北海道","音威子府村",10,0.1,2,"",2]
["市区町村","014711","北海道","中川町",12,0.12,2,"",2]
["市区町村","014729","北海道","幌加内町",10,0.1,2,"",2]
["市区町村","014818","北海道","増毛町",15,0.15,2,"",2]
["市区町村","014826","北海道","小平町",14,0.14000000000000001,2,"",2]
["市区町村","014834","北海道","苫前町",15,0.15,2,"",2]
["市区町村","014842","北海道","羽幌町",20,0.2,2,"",2]
["市区町村","014851","北海道","初山別村",11,0.11,2,"",2]
["市区町村","014869","北海道","遠別町",13,0.13,2,"",2]
["市区町村","014877","北海道","天塩町",17,0.17,2,"",2]
["市区町村","015113","北海道","猿払村",23,0.23,2,"",2]
["市区町村","015121","北海道","浜頓別町",20,0.2,2,"",2]
["市区町村","015130","北海道","中頓別町",11,0.11,2,"",2]
["市区町村","015148","北海道","枝幸町",22,0.22,2,"",2]
["市区町村","015164","北海道","豊富町",25,0.25,2,"",2]
["市区町村","015172","北海道","礼文町",12,0.12,2,"",2]
["市区町村","015181","北海道","利尻町",11,0.11,2,"",2]
["市区町村","015199","北海道","利尻富士町",12,0.12,2,"",2]
["市区町村","015202","北海道","幌延町",24,0.24,2,"",2]
["市区町村","015431","北海道","美幌町",36,0.36,2,"",2]
["市区町村","015440","北海道","津別町",20,0.2,2,"",2]
["市区町村","015458","北海道","斜里町",33,0.33,2,"",2]
["市区町村","015466","北海道","清里町",18,0.18,2,"",2]
["市区町村","015474","北海道","小清水町",21,0.21,2,"",2]
["市区町村","015491","北海道","訓子府町",22,0.22,2,"",2]
["市区町村","015504","北海道","置戸町",14,0.14000000000000001,2,"",2]
["市区町村","015521","北海道","佐呂間町",25,0.25,2,"",2]
["市区町村","015555","北海道","遠軽町",26,0.26,2,"",2]
["市区町村","015598","北海道","湧別町",27,0.27,2,"",2]
["市区町村","015601","北海道","滝上町",12,{"$f":"IF(A180=\"都道府県\",E180/100000,IF(A180=\"市区町村\",E180/100,\"エラー\"))","v":0.12},2,"",2]
["市区町村","015610","北海道","興部町",23,0.23,2,"",2]
["市区町村","015628","北海道","西興部村",10,0.1,2,"",2]
["市区町村","015636","北海道","雄武町",21,0.21,2,"",2]
["市区町村","015644","北海道","大空町",25,0.25,2,"",2]
["市区町村","015717","北海道","豊浦町",16,0.16,2,"",2]
["市区町村","015750","北海道","壮瞥町",19,0.19,2,"",2]
["市区町村","015784","北海道","白老町",38,0.38,2,"",2]
["市区町村","015814","北海道","厚真町",37,0.37,2,"",2]
["市区町村","015849","北海道","洞爺湖町",26,0.26,2,"",2]
["市区町村","015857","北海道","安平町",43,0.43,2,"",2]
["市区町村","015865","北海道","むかわ町",23,0.23,2,"",2]
["市区町村","016012","北海道","日高町",25,0.25,2,"",2]
["市区町村","016021","北海道","平取町",17,0.17,2,"",2]
["市区町村","016047","北海道","新冠町",23,0.23,2,{"$f":"IF(_xlfn.IFNA(VLOOKUP(B194,$T:$T,1,0),\"\")=\"\",\"\",\"〇\")","v":""},2]
["市区町村","016071","北海道","浦河町",29,0.28999999999999998,{"$f":"IF(F195<>\"エラー\",IF(F195>=$N$16, 1, IF(F195<=$N$18, 3, 2)),\"エラー\")","v":2},"",{"$f":"IF(H195=\"〇\",1,G195)","v":2}]
["市区町村","016080","北海道","様似町",17,0.17,2,"",2]
["市区町村","016098","北海道","えりも町",18,0.18,2,"",2]
["市区町村","016101","北海道","新ひだか町",34,0.34,2,"",2]
["市区町村","016314","北海道","音更町",50,0.5,2,"",2]
["市区町村","016322","北海道","士幌町",30,0.3,2,"",2]
["市区町村","016331","北海道","上士幌町",24,0.24,2,"",2]
["市区町村","016349","北海道","鹿追町",25,0.25,2,"",2]
["市区町村","016357","北海道","新得町",24,0.24,2,"",2]
["市区町村","016365","北海道","清水町",32,0.32,2,"",2]
["市区町村","016373","北海道","芽室町",48,0.48,2,"",2]
["市区町村","016381","北海道","中札内村",28,0.28000000000000003,2,"",2]
["市区町村","016390","北海道","更別村",25,0.25,2,"",2]
["市区町村","016411","北海道","大樹町",25,0.25,2,"",2]
["市区町村","016420","北海道","広尾町",23,0.23,2,"",2]
["市区町村","016438","北海道","幕別町",36,0.36,2,"",2]
["市区町村","016446","北海道","池田町",22,0.22,2,"",2]
["市区町村","016454","北海道","豊頃町",21,0.21,2,"",2]
["市区町村","016462","北海道","本別町",26,0.26,2,"",2]
["市区町村","016471","北海道","足寄町",20,0.2,2,"",2]
["市区町村","016489","北海道","陸別町",17,0.17,2,"",2]
["市区町村","016497","北海道","浦幌町",20,0.2,2,"",2]
["市区町村","016616","北海道","釧路町",50,0.5,2,"",2]
["市区町村","016624","北海道","厚岸町",23,0.23,2,"",2]
["市区町村","016632","北海道","浜中町",21,0.21,2,"",2]
["市区町村","016641","北海道","標茶町",23,0.23,2,"",2]
["市区町村","016659","北海道","弟子屈町",23,0.23,2,"",2]
["市区町村","016675","北海道","鶴居村",19,0.19,2,"",2]
["市区町村","016683","北海道","白糠町",24,0.24,2,"",2]
["市区町村","016918","北海道","別海町",31,0.31,2,"",2]
["市区町村","016926","北海道","中標津町",42,0.42,2,"",2]
["市区町村","016934","北海道","標津町",21,0.21,2,"",2]
["市区町村","016942","北海道","羅臼町",22,0.22,2,"",2]
["市区町村","022012","青森県","青森市",55,0.55000000000000004,2,"",2]
["市区町村","022021","青森県","弘前市",49,0.49,2,"",2]
["市区町村","022039","青森県","八戸市",63,0.63,2,"",2]
["市区町村","022047","青森県","黒石市",37,0.37,2,"",2]
["市区町村","022055","青森県","五所川原市",33,0.33,2,"",2]
["市区町村","022063","青森県","十和田市",44,0.44,2,"",2]
["市区町村","022071","青森県","三沢市",51,0.51,2,"",2]
["市区町村","022080","青森県","むつ市",36,0.36,2,"",2]
["市区町村","022098","青森県","つがる市",25,0.25,2,"",2]
["市区町村","022101","青森県","平川市",30,0.3,2,"",2]
["市区町村","023019","青森県","平内町",24,0.24,2,"",2]
["市区町村","023035","青森県","今別町",21,0.21,2,"",2]
["市区町村","023043","青森県","蓬田村",19,0.19,2,"",2]
["市区町村","023078","青森県","外ヶ浜町",18,0.18,2,"",2]
["市区町村","023213","青森県","鰺ケ沢町",22,0.22,2,"",2]
["市区町村","023230","青森県","深浦町",18,0.18,2,"",2]
["市区町村","023434","青森県","西目屋村",12,{"$f":"IF(A244=\"都道府県\",E244/100000,IF(A244=\"市区町村\",E244/100,\"エラー\"))","v":0.12},2,"",2]
["市区町村","023612","青森県","藤崎町",30,0.3,2,"",2]
["市区町村","023621","青森県","大鰐町",22,0.22,2,"",2]
["市区町村","023671","青森県","田舎館村",26,0.26,2,"",2]
["市区町村","023817","青森県","板柳町",27,0.27,2,"",2]
["市区町村","023841","青森県","鶴田町",27,0.27,2,"",2]
["市区町村","023876","青森県","中泊町",23,0.23,2,"",2]
["市区町村","024015","青森県","野辺地町",37,0.37,2,"",2]
["市区町村","024023","青森県","七戸町",37,0.37,2,"",2]
["市区町村","024058","青森県","六戸町",41,0.41,2,"",2]
["市区町村","024066","青森県","横浜町",31,0.31,2,"",2]
["市区町村","024082","青森県","東北町",31,0.31,2,"",2]
["市区町村","024112","青森県","六ケ所村",168,1.68,1,"",1]
["市区町村","024121","青森県","おいらせ町",46,0.46,2,"",2]
["市区町村","024236","青森県","大間町",27,0.27,2,{"$f":"IF(_xlfn.IFNA(VLOOKUP(B258,$T:$T,1,0),\"\")=\"\",\"\",\"〇\")","v":""},2]
["市区町村","024244","青森県","東通村",54,0.54,{"$f":"IF(F259<>\"エラー\",IF(F259>=$N$16, 1, IF(F259<=$N$18, 3, 2)),\"エラー\")","v":2},"",{"$f":"IF(H259=\"〇\",1,G259)","v":2}]
["市区町村","024252","青森県","風間浦村",10,0.1,2,"",2]
["市区町村","024261","青森県","佐井村",12,0.12,2,"",2]
["市区町村","024414","青森県","三戸町",25,0.25,2,"",2]
["市区町村","024422","青森県","五戸町",27,0.27,2,"",2]
["市区町村","024431","青森県","田子町",21,0.21,2,"",2]
["市区町村","024457","青森県","南部町",30,0.3,2,"",2]
["市区町村","024465","青森県","階上町",35,0.35,2,"",2]
["市区町村","024503","青森県","新郷村",16,0.16,2,"",2]
["市区町村","032018","岩手県","盛岡市",70,0.7,2,"",2]
["市区町村","032026","岩手県","宮古市",36,0.36,2,"",2]
["市区町村","032034","岩手県","大船渡市",44,0.44,2,"",2]
["市区町村","032051","岩手県","花巻市",47,0.47,2,"",2]
["市区町村","032069","岩手県","北上市",95,0.95,2,"",2]
["市区町村","032077","岩手県","久慈市",40,0.4,2,"",2]
["市区町村","032085","岩手県","遠野市",33,0.33,2,"",2]
["市区町村","032093","岩手県","一関市",37,0.37,2,"",2]
["市区町村","032107","岩手県","陸前高田市",32,0.32,2,"",2]
["市区町村","032115","岩手県","釜石市",49,0.49,2,"",2]
["市区町村","032131","岩手県","二戸市",37,0.37,2,"",2]
["市区町村","032140","岩手県","八幡平市",31,0.31,2,"",2]
["市区町村","032158","岩手県","奥州市",44,0.44,2,"",2]
["市区町村","032166","岩手県","滝沢市",57,0.56999999999999995,2,"",2]
["市区町村","033014","岩手県","雫石町",38,0.38,2,"",2]
["市区町村","033022","岩手県","葛巻町",17,0.17,2,"",2]
["市区町村","033031","岩手県","岩手町",33,0.33,2,"",2]
["市区町村","033219","岩手県","紫波町",46,0.46,2,"",2]
["市区町村","033227","岩手県","矢巾町",66,0.66,2,"",2]
["市区町村","033669","岩手県","西和賀町",14,0.14000000000000001,2,"",2]
["市区町村","033812","岩手県","金ケ崎町",64,0.64,2,"",2]
["市区町村","034029","岩手県","平泉町",31,0.31,2,"",2]
["市区町村","034410","岩手県","住田町",22,0.22,2,"",2]
["市区町村","034614","岩手県","大槌町",28,0.28000000000000003,2,"",2]
["市区町村","034827","岩手県","山田町",31,0.31,2,"",2]
["市区町村","034835","岩手県","岩泉町",16,0.16,2,"",2]
["市区町村","034843","岩手県","田野畑村",15,0.15,2,"",2]
["市区町村","034851","岩手県","普代村",14,0.14000000000000001,2,"",2]
["市区町村","035017","岩手県","軽米町",35,0.35,2,"",2]
["市区町村","035033","岩手県","野田村",20,0.2,2,"",2]
["市区町村","035068","岩手県","九戸村",20,0.2,2,"",2]
["市区町村","035076","岩手県","洋野町",26,0.26,2,"",2]
["市区町村","035246","岩手県","一戸町",34,0.34,2,"",2]
["市区町村","041009","宮城県","仙台市",87,0.87,2,"",2]
["市区町村","042021","宮城県","石巻市",53,0.53,2,"",2]
["市区町村","042030","宮城県","塩竈市",52,0.52,2,"",2]
["市区町村","042056","宮城県","気仙沼市",45,0.45,2,"",2]
["市区町村","042064","宮城県","白石市",50,0.5,2,"",2]
["市区町村","042072","宮城県","名取市",80,0.8,2,"",2]
["市区町村","042081","宮城県","角田市",50,0.5,2,"",2]
["市区町村","042099","宮城県","多賀城市",69,{"$f":"IF(A308=\"都道府県\",E308/100000,IF(A308=\"市区町村\",E308/100,\"エラー\"))","v":0.69},2,"",2]
["市区町村","042111","宮城県","岩沼市",80,0.8,2,"",2]
["市区町村","042129","宮城県","登米市",36,0.36,2,"",2]
["市区町村","042137","宮城県","栗原市",32,0.32,2,"",2]
["市区町村","042145","宮城県","東松島市",45,0.45,2,"",2]
["市区町村","042153","宮城県","大崎市",49,0.49,2,"",2]
["市区町村","042161","宮城県","富谷市",75,0.75,2,"",2]
["市区町村","043010","宮城県","蔵王町",43,0.43,2,"",2]
["市区町村","043028","宮城県","七ケ宿町",31,0.31,2,"",2]
["市区町村","043214","宮城県","大河原町",60,0.6,2,"",2]
["市区町村","043222","宮城県","村田町",42,0.42,2,"",2]
["市区町村","043231","宮城県","柴田町",59,0.59,2,"",2]
["市区町村","043249","宮城県","川崎町",32,0.32,2,"",2]
["市区町村","043419","宮城県","丸森町",31,0.31,2,"",2]
["市区町村","043613","宮城県","亘理町",57,0.56999999999999995,2,{"$f":"IF(_xlfn.IFNA(VLOOKUP(B322,$T:$T,1,0),\"\")=\"\",\"\",\"〇\")","v":""},2]
["市区町村","043621","宮城県","山元町",36,0.36,{"$f":"IF(F323<>\"エラー\",IF(F323>=$N$16, 1, IF(F323<=$N$18, 3, 2)),\"エラー\")","v":2},"",{"$f":"IF(H323=\"〇\",1,G323)","v":2}]
["市区町村","044016","宮城県","松島町",45,0.45,2,"",2]
["市区町村","044041","宮城県","七ケ浜町",49,0.49,2,"",2]
["市区町村","044067","宮城県","利府町",78,0.78,2,"",2]
["市区町村","044211","宮城県","大和町",106,1.06,1,"",1]
["市区町村","044229","宮城県","大郷町",52,0.52,2,"",2]
["市区町村","044245","宮城県","大衡村",77,0.77,2,"",2]
["市区町村","044440","宮城県","色麻町",28,0.28000000000000003,2,"",2]
["市区町村","044458","宮城県","加美町",35,0.35,2,"",2]
["市区町村","045012","宮城県","涌谷町",38,0.38,2,"",2]
["市区町村","045055","宮城県","美里町",42,0.42,2,"",2]
["市区町村","045811","宮城県","女川町",93,0.93,2,"",2]
["市区町村","046060","宮城県","南三陸町",29,0.28999999999999998,2,"",2]
["市区町村","052019","秋田県","秋田市",65,0.65,2,"",2]
["市区町村","052027","秋田県","能代市",50,0.5,2,"",2]
["市区町村","052035","秋田県","横手市",33,0.33,2,"",2]
["市区町村","052043","秋田県","大館市",42,0.42,2,"",2]
["市区町村","052060","秋田県","男鹿市",34,0.34,2,"",2]
["市区町村","052078","秋田県","湯沢市",32,0.32,2,"",2]
["市区町村","052094","秋田県","鹿角市",32,0.32,2,"",2]
["市区町村","052108","秋田県","由利本荘市",35,0.35,2,"",2]
["市区町村","052116","秋田県","潟上市",35,0.35,2,"",2]
["市区町村","052124","秋田県","大仙市",35,0.35,2,"",2]
["市区町村","052132","秋田県","北秋田市",27,0.27,2,"",2]
["市区町村","052141","秋田県","にかほ市",36,0.36,2,"",2]
["市区町村","052159","秋田県","仙北市",27,0.27,2,"",2]
["市区町村","053031","秋田県","小坂町",38,0.38,2,"",2]
["市区町村","053279","秋田県","上小阿仁村",12,0.12,2,"",2]
["市区町村","053465","秋田県","藤里町",13,0.13,2,"",2]
["市区町村","053481","秋田県","三種町",25,0.25,2,"",2]
["市区町村","053490","秋田県","八峰町",18,0.18,2,"",2]
["市区町村","053619","秋田県","五城目町",24,0.24,2,"",2]
["市区町村","053635","秋田県","八郎潟町",24,0.24,2,"",2]
["市区町村","053660","秋田県","井川町",21,0.21,2,"",2]
["市区町村","053686","秋田県","大潟村",34,0.34,2,"",2]
["市区町村","054348","秋田県","美郷町",24,0.24,2,"",2]
["市区町村","054631","秋田県","羽後町",25,0.25,2,"",2]
["市区町村","054640","秋田県","東成瀬村",13,0.13,2,"",2]
["市区町村","062014","山形県","山形市",74,0.74,2,"",2]
["市区町村","062022","山形県","米沢市",59,0.59,2,"",2]
["市区町村","062031","山形県","鶴岡市",41,0.41,2,"",2]
["市区町村","062049","山形県","酒田市",48,0.48,2,"",2]
["市区町村","062057","山形県","新庄市",50,0.5,2,"",2]
["市区町村","062065","山形県","寒河江市",53,0.53,2,"",2]
["市区町村","062073","山形県","上山市",48,0.48,2,"",2]
["市区町村","062081","山形県","村山市",35,0.35,2,"",2]
["市区町村","062090","山形県","長井市",42,0.42,2,"",2]
["市区町村","062103","山形県","天童市",65,0.65,2,"",2]
["市区町村","062111","山形県","東根市",62,0.62,2,"",2]
["市区町村","062120","山形県","尾花沢市",28,{"$f":"IF(A372=\"都道府県\",E372/100000,IF(A372=\"市区町村\",E372/100,\"エラー\"))","v":0.28000000000000003},2,"",2]
["市区町村","062138","山形県","南陽市",47,0.47,2,"",2]
["市区町村","063011","山形県","山辺町",38,0.38,2,"",2]
["市区町村","063029","山形県","中山町",35,0.35,2,"",2]
["市区町村","063215","山形県","河北町",44,0.44,2,"",2]
["市区町村","063223","山形県","西川町",22,0.22,2,"",2]
["市区町村","063231","山形県","朝日町",19,0.19,2,"",2]
["市区町村","063240","山形県","大江町",26,0.26,2,"",2]
["市区町村","063410","山形県","大石田町",22,0.22,2,"",2]
["市区町村","063614","山形県","金山町",19,0.19,2,"",2]
["市区町村","063622","山形県","最上町",22,0.22,2,"",2]
["市区町村","063631","山形県","舟形町",19,0.19,2,"",2]
["市区町村","063649","山形県","真室川町",21,0.21,2,"",2]
["市区町村","063657","山形県","大蔵村",15,0.15,2,"",2]
["市区町村","063665","山形県","鮭川村",17,0.17,2,{"$f":"IF(_xlfn.IFNA(VLOOKUP(B386,$T:$T,1,0),\"\")=\"\",\"\",\"〇\")","v":""},2]
["市区町村","063673","山形県","戸沢村",16,0.16,{"$f":"IF(F387<>\"エラー\",IF(F387>=$N$16, 1, IF(F387<=$N$18, 3, 2)),\"エラー\")","v":2},"",{"$f":"IF(H387=\"〇\",1,G387)","v":2}]
["市区町村","063819","山形県","高畠町",41,0.41,2,"",2]
["市区町村","063827","山形県","川西町",26,0.26,2,"",2]
["市区町村","064017","山形県","小国町",31,0.31,2,"",2]
["市区町村","064025","山形県","白鷹町",27,0.27,2,"",2]
["市区町村","064033","山形県","飯豊町",20,0.2,2,"",2]
["市区町村","064262","山形県","三川町",37,0.37,2,"",2]
["市区町村","064289","山形県","庄内町",31,0.31,2,"",2]
["市区町村","064611","山形県","遊佐町",29,0.28999999999999998,2,"",2]
["市区町村","072010","福島県","福島市",75,0.75,2,"",2]
["市区町村","072028","福島県","会津若松市",62,0.62,2,"",2]
["市区町村","072036","福島県","郡山市",81,0.81,2,"",2]
["市区町村","072044","福島県","いわき市",78,0.78,2,"",2]
["市区町村","072052","福島県","白河市",62,0.62,2,"",2]
["市区町村","072079","福島県","須賀川市",56,0.56000000000000005,2,"",2]
["市区町村","072087","福島県","喜多方市",37,0.37,2,"",2]
["市区町村","072095","福島県","相馬市",62,0.62,2,"",2]
["市区町村","072109","福島県","二本松市",46,0.46,2,"",2]
["市区町村","072117","福島県","田村市",35,0.35,2,"",2]
["市区町村","072125","福島県","南相馬市",64,0.64,2,"",2]
["市区町村","072133","福島県","伊達市",41,0.41,2,"",2]
["市区町村","072141","福島県","本宮市",65,0.65,2,"",2]
["市区町村","073016","福島県","桑折町",42,0.42,2,"",2]
["市区町村","073032","福島県","国見町",29,0.28999999999999998,2,"",2]
["市区町村","073083","福島県","川俣町",33,0.33,2,"",2]
["市区町村","073229","福島県","大玉村",37,0.37,2,"",2]
["市区町村","073423","福島県","鏡石町",55,0.55000000000000004,2,"",2]
["市区町村","073440","福島県","天栄村",30,0.3,2,"",2]
["市区町村","073628","福島県","下郷町",32,0.32,2,"",2]
["市区町村","073644","福島県","檜枝岐村",26,0.26,2,"",2]
["市区町村","073679","福島県","只見町",21,0.21,2,"",2]
["市区町村","073687","福島県","南会津町",24,0.24,2,"",2]
["市区町村","074021","福島県","北塩原村",22,0.22,2,"",2]
["市区町村","074055","福島県","西会津町",19,0.19,2,"",2]
["市区町村","074071","福島県","磐梯町",30,0.3,2,"",2]
["市区町村","074080","福島県","猪苗代町",37,0.37,2,"",2]
["市区町村","074217","福島県","会津坂下町",38,0.38,2,"",2]
["市区町村","074225","福島県","湯川村",21,0.21,2,"",2]
["市区町村","074233","福島県","柳津町",18,0.18,2,"",2]
["市区町村","074446","福島県","三島町",13,0.13,2,"",2]
["市区町村","074454","福島県","金山町",24,0.24,2,"",2]
["市区町村","074462","福島県","昭和村",9,0.09,2,"",2]
["市区町村","074471","福島県","会津美里町",31,0.31,2,"",2]
["市区町村","074616","福島県","西郷村",106,1.06,1,"",1]
["市区町村","074641","福島県","泉崎村",52,0.52,2,"",2]
["市区町村","074659","福島県","中島村",29,0.28999999999999998,2,"",2]
["市区町村","074667","福島県","矢吹町",60,0.6,2,"",2]
["市区町村","074811","福島県","棚倉町",52,0.52,2,"",2]
["市区町村","074829","福島県","矢祭町",37,0.37,2,"",2]
["市区町村","074837","福島県","塙町",28,{"$f":"IF(A436=\"都道府県\",E436/100000,IF(A436=\"市区町村\",E436/100,\"エラー\"))","v":0.28000000000000003},2,"",2]
["市区町村","074845","福島県","鮫川村",18,0.18,2,"",2]
["市区町村","075019","福島県","石川町",41,0.41,2,"",2]
["市区町村","075027","福島県","玉川村",34,0.34,2,"",2]
["市区町村","075035","福島県","平田村",24,0.24,2,"",2]
["市区町村","075043","福島県","浅川町",31,0.31,2,"",2]
["市区町村","075051","福島県","古殿町",21,0.21,2,"",2]
["市区町村","075213","福島県","三春町",44,0.44,2,"",2]
["市区町村","075221","福島県","小野町",37,0.37,2,"",2]
["市区町村","075418","福島県","広野町",144,1.44,1,"",1]
["市区町村","075426","福島県","楢葉町",70,0.7,2,"",2]
["市区町村","075434","福島県","富岡町",64,0.64,2,"",2]
["市区町村","075442","福島県","川内村",28,0.28000000000000003,2,"",2]
["市区町村","075451","福島県","大熊町",159,1.59,1,"",1]
["市区町村","075469","福島県","双葉町",73,0.73,2,{"$f":"IF(_xlfn.IFNA(VLOOKUP(B450,$T:$T,1,0),\"\")=\"\",\"\",\"〇\")","v":""},2]
["市区町村","075477","福島県","浪江町",41,0.41,{"$f":"IF(F451<>\"エラー\",IF(F451>=$N$16, 1, IF(F451<=$N$18, 3, 2)),\"エラー\")","v":2},"",{"$f":"IF(H451=\"〇\",1,G451)","v":2}]
["市区町村","075485","福島県","葛尾村",16,0.16,2,"",2]
["市区町村","075612","福島県","新地町",104,1.04,1,"",1]
["市区町村","075647","福島県","飯舘村",25,0.25,2,"",2]
["市区町村","082015","茨城県","水戸市",78,0.78,2,"",2]
["市区町村","082023","茨城県","日立市",77,0.77,2,"",2]
["市区町村","082031","茨城県","土浦市",81,0.81,2,"",2]
["市区町村","082040","茨城県","古河市",73,0.73,2,"",2]
["市区町村","082058","茨城県","石岡市",58,0.57999999999999996,2,"",2]
["市区町村","082074","茨城県","結城市",69,0.69,2,"",2]
["市区町村","082082","茨城県","龍ケ崎市",71,0.71,2,"",2]
["市区町村","082104","茨城県","下妻市",68,0.68,2,"",2]
["市区町村","082112","茨城県","常総市",70,0.7,2,"",2]
["市区町村","082121","茨城県","常陸太田市",41,0.41,2,"",2]
["市区町村","082147","茨城県","高萩市",57,0.56999999999999995,2,"",2]
["市区町村","082155","茨城県","北茨城市",68,0.68,2,"",2]
["市区町村","082163","茨城県","笠間市",59,0.59,2,"",2]
["市区町村","082171","茨城県","取手市",59,0.59,2,"",2]
["市区町村","082198","茨城県","牛久市",78,0.78,2,"",2]
["市区町村","082201","茨城県","つくば市",110,1.1000000000000001,1,"",1]
["市区町村","082210","茨城県","ひたちなか市",90,0.9,2,"",2]
["市区町村","082228","茨城県","鹿嶋市",96,0.96,2,"",2]
["市区町村","082236","茨城県","潮来市",48,0.48,2,"",2]
["市区町村","082244","茨城県","守谷市",96,0.96,2,"",2]
["市区町村","082252","茨城県","常陸大宮市",43,0.43,2,"",2]
["市区町村","082261","茨城県","那珂市",61,0.61,2,"",2]
["市区町村","082279","茨城県","筑西市",65,0.65,2,"",2]
["市区町村","082287","茨城県","坂東市",66,0.66,2,"",2]
["市区町村","082295","茨城県","稲敷市",47,0.47,2,"",2]
["市区町村","082309","茨城県","かすみがうら市",57,0.56999999999999995,2,"",2]
["市区町村","082317","茨城県","桜川市",46,0.46,2,"",2]
["市区町村","082325","茨城県","神栖市",135,1.35,1,"",1]
["市区町村","082333","茨城県","行方市",44,0.44,2,"",2]
["市区町村","082341","茨城県","鉾田市",46,0.46,2,"",2]
["市区町村","082350","茨城県","つくばみらい市",75,0.75,2,"",2]
["市区町村","082368","茨城県","小美玉市",57,0.56999999999999995,2,"",2]
["市区町村","083020","茨城県","茨城町",59,0.59,2,"",2]
["市区町村","083097","茨城県","大洗町",66,0.66,2,"",2]
["市区町村","083101","茨城県","城里町",36,0.36,2,"",2]
["市区町村","083411","茨城県","東海村",136,1.36,1,"",1]
["市区町村","083640","茨城県","大子町",32,0.32,2,"",2]
["市区町村","084425","茨城県","美浦村",61,0.61,2,"",2]
["市区町村","084433","茨城県","阿見町",88,0.88,2,"",2]
["市区町村","084476","茨城県","河内町",33,0.33,2,"",2]
["市区町村","085219","茨城県","八千代町",62,0.62,2,"",2]
["市区町村","085421","茨城県","五霞町",79,0.79,2,"",2]
["市区町村","085464","茨城県","境町",67,0.67,2,"",2]
["市区町村","085642","茨城県","利根町",37,0.37,2,"",2]
["市区町村","092011","栃木県","宇都宮市",97,0.97,2,"",2]
["市区町村","092029","栃木県","足利市",73,{"$f":"IF(A500=\"都道府県\",E500/100000,IF(A500=\"市区町村\",E500/100,\"エラー\"))","v":0.73},2,"",2]
["市区町村","092037","栃木県","栃木市",69,0.69,2,"",2]
["市区町村","092045","栃木県","佐野市",69,0.69,2,"",2]
["市区町村","092053","栃木県","鹿沼市",69,0.69,2,"",2]
["市区町村","092061","栃木県","日光市",55,0.55000000000000004,2,"",2]
["市区町村","092088","栃木県","小山市",94,0.94,2,"",2]
["市区町村","092096","栃木県","真岡市",82,0.82,2,"",2]
["市区町村","092100","栃木県","大田原市",64,0.64,2,"",2]
["市区町村","092118","栃木県","矢板市",64,0.64,2,"",2]
["市区町村","092134","栃木県","那須塩原市",76,0.76,2,"",2]
["市区町村","092142","栃木県","さくら市",69,0.69,2,"",2]
["市区町村","092151","栃木県","那須烏山市",45,0.45,2,"",2]
["市区町村","092169","栃木県","下野市",70,0.7,2,"",2]
["市区町村","093017","栃木県","上三川町",93,0.93,2,"",2]
["市区町村","093424","栃木県","益子町",55,0.55000000000000004,2,{"$f":"IF(_xlfn.IFNA(VLOOKUP(B514,$T:$T,1,0),\"\")=\"\",\"\",\"〇\")","v":""},2]
["市区町村","093432","栃木県","茂木町",37,0.37,{"$f":"IF(F515<>\"エラー\",IF(F515>=$N$16, 1, IF(F515<=$N$18, 3, 2)),\"エラー\")","v":2},"",{"$f":"IF(H515=\"〇\",1,G515)","v":2}]
["市区町村","093441","栃木県","市貝町",60,0.6,2,"",2]
["市区町村","093459","栃木県","芳賀町",98,0.98,2,"",2]
["市区町村","093611","栃木県","壬生町",81,0.81,2,"",2]
["市区町村","093645","栃木県","野木町",74,0.74,2,"",2]
["市区町村","093840","栃木県","塩谷町",41,0.41,2,"",2]
["市区町村","093866","栃木県","高根沢町",72,0.72,2,"",2]
["市区町村","094072","栃木県","那須町",68,0.68,2,"",2]
["市区町村","094111","栃木県","那珂川町",37,0.37,2,"",2]
["市区町村","102016","群馬県","前橋市",77,0.77,2,"",2]
["市区町村","102024","群馬県","高崎市",81,0.81,2,"",2]
["市区町村","102032","群馬県","桐生市",55,0.55000000000000004,2,"",2]
["市区町村","102041","群馬県","伊勢崎市",80,0.8,2,"",2]
["市区町村","102059","群馬県","太田市",94,0.94,2,"",2]
["市区町村","102067","群馬県","沼田市",50,0.5,2,"",2]
["市区町村","102075","群馬県","館林市",78,0.78,2,"",2]
["市区町村","102083","群馬県","渋川市",57,0.56999999999999995,2,"",2]
["市区町村","102091","群馬県","藤岡市",64,0.64,2,"",2]
["市区町村","102105","群馬県","富岡市",62,0.62,2,"",2]
["市区町村","102113","群馬県","安中市",81,0.81,2,"",2]
["市区町村","102121","群馬県","みどり市",62,0.62,2,"",2]
["市区町村","103446","群馬県","榛東村",52,0.52,2,"",2]
["市区町村","103454","群馬県","吉岡町",68,0.68,2,"",2]
["市区町村","103667","群馬県","上野村",73,0.73,2,"",2]
["市区町村","103675","群馬県","神流町",16,0.16,2,"",2]
["市区町村","103829","群馬県","下仁田町",26,0.26,2,"",2]
["市区町村","103837","群馬県","南牧村",13,0.13,2,"",2]
["市区町村","103845","群馬県","甘楽町",48,0.48,2,"",2]
["市区町村","104213","群馬県","中之条町",35,0.35,2,"",2]
["市区町村","104248","群馬県","長野原町",52,0.52,2,"",2]
["市区町村","104256","群馬県","嬬恋村",42,0.42,2,"",2]
["市区町村","104264","群馬県","草津町",58,0.57999999999999996,2,"",2]
["市区町村","104281","群馬県","高山村",28,0.28000000000000003,2,"",2]
["市区町村","104299","群馬県","東吾妻町",39,0.39,2,"",2]
["市区町村","104434","群馬県","片品村",24,0.24,2,"",2]
["市区町村","104442","群馬県","川場村",24,0.24,2,"",2]
["市区町村","104485","群馬県","昭和村",44,0.44,2,"",2]
["市区町村","104493","群馬県","みなかみ町",39,0.39,2,"",2]
["市区町村","104647","群馬県","玉村町",74,0.74,2,"",2]
["市区町村","105210","群馬県","板倉町",60,0.6,2,"",2]
["市区町村","105228","群馬県","明和町",93,0.93,2,"",2]
["市区町村","105236","群馬県","千代田町",69,0.69,2,"",2]
["市区町村","105244","群馬県","大泉町",92,0.92,2,"",2]
["市区町村","105252","群馬県","邑楽町",74,0.74,2,"",2]
["市区町村","111007","埼玉県","さいたま市",95,0.95,2,"",2]
["市区町村","112011","埼玉県","川越市",94,0.94,2,"",2]
["市区町村","112020","埼玉県","熊谷市",82,0.82,2,"",2]
["市区町村","112038","埼玉県","川口市",94,0.94,2,"",2]
["市区町村","112062","埼玉県","行田市",66,0.66,2,"",2]
["市区町村","112071","埼玉県","秩父市",56,{"$f":"IF(A564=\"都道府県\",E564/100000,IF(A564=\"市区町村\",E564/100,\"エラー\"))","v":0.56000000000000005},2,"",2]
["市区町村","112089","埼玉県","所沢市",94,0.94,2,"",2]
["市区町村","112097","埼玉県","飯能市",70,0.7,2,"",2]
["市区町村","112101","埼玉県","加須市",73,0.73,2,"",2]
["市区町村","112119","埼玉県","本庄市",72,0.72,2,"",2]
["市区町村","112127","埼玉県","東松山市",79,0.79,2,"",2]
["市区町村","112143","埼玉県","春日部市",71,0.71,2,"",2]
["市区町村","112151","埼玉県","狭山市",84,0.84,2,"",2]
["市区町村","112160","埼玉県","羽生市",76,0.76,2,"",2]
["市区町村","112178","埼玉県","鴻巣市",65,0.65,2,"",2]
["市区町村","112186","埼玉県","深谷市",71,0.71,2,"",2]
["市区町村","112194","埼玉県","上尾市",85,0.85,2,"",2]
["市区町村","112216","埼玉県","草加市",89,0.89,2,"",2]
["市区町村","112224","埼玉県","越谷市",86,0.86,2,"",2]
["市区町村","112232","埼玉県","蕨市",81,0.81,2,{"$f":"IF(_xlfn.IFNA(VLOOKUP(B578,$T:$T,1,0),\"\")=\"\",\"\",\"〇\")","v":""},2]
["市区町村","112241","埼玉県","戸田市",122,1.22,{"$f":"IF(F579<>\"エラー\",IF(F579>=$N$16, 1, IF(F579<=$N$18, 3, 2)),\"エラー\")","v":1},"",{"$f":"IF(H579=\"〇\",1,G579)","v":1}]
["市区町村","112259","埼玉県","入間市",86,0.86,2,"",2]
["市区町村","112275","埼玉県","朝霞市",98,0.98,2,"",2]
["市区町村","112283","埼玉県","志木市",79,0.79,2,"",2]
["市区町村","112291","埼玉県","和光市",108,1.08,1,"",1]
["市区町村","112305","埼玉県","新座市",87,0.87,2,"",2]
["市区町村","112313","埼玉県","桶川市",73,0.73,2,"",2]
["市区町村","112321","埼玉県","久喜市",80,0.8,2,"",2]
["市区町村","112330","埼玉県","北本市",72,0.72,2,"",2]
["市区町村","112348","埼玉県","八潮市",103,1.03,1,"",1]
["市区町村","112356","埼玉県","富士見市",78,0.78,2,"",2]
["市区町村","112372","埼玉県","三郷市",90,0.9,2,"",2]
["市区町村","112381","埼玉県","蓮田市",71,0.71,2,"",2]
["市区町村","112399","埼玉県","坂戸市",78,0.78,2,"",2]
["市区町村","112402","埼玉県","幸手市",67,0.67,2,"",2]
["市区町村","112411","埼玉県","鶴ケ島市",79,0.79,2,"",2]
["市区町村","112429","埼玉県","日高市",80,0.8,2,"",2]
["市区町村","112437","埼玉県","吉川市",78,0.78,2,"",2]
["市区町村","112453","埼玉県","ふじみ野市",76,0.76,2,"",2]
["市区町村","112461","埼玉県","白岡市",76,0.76,2,"",2]
["市区町村","113018","埼玉県","伊奈町",80,0.8,2,"",2]
["市区町村","113247","埼玉県","三芳町",109,1.0900000000000001,1,"",1]
["市区町村","113263","埼玉県","毛呂山町",58,0.57999999999999996,2,"",2]
["市区町村","113271","埼玉県","越生町",46,0.46,2,"",2]
["市区町村","113417","埼玉県","滑川町",80,0.8,2,"",2]
["市区町村","113425","埼玉県","嵐山町",73,0.73,2,"",2]
["市区町村","113433","埼玉県","小川町",59,0.59,2,"",2]
["市区町村","113468","埼玉県","川島町",72,0.72,2,"",2]
["市区町村","113476","埼玉県","吉見町",63,0.63,2,"",2]
["市区町村","113484","埼玉県","鳩山町",50,0.5,2,"",2]
["市区町村","113492","埼玉県","ときがわ町",38,0.38,2,"",2]
["市区町村","113611","埼玉県","横瀬町",47,0.47,2,"",2]
["市区町村","113620","埼玉県","皆野町",39,0.39,2,"",2]
["市区町村","113638","埼玉県","長瀞町",36,0.36,2,"",2]
["市区町村","113654","埼玉県","小鹿野町",30,0.3,2,"",2]
["市区町村","113697","埼玉県","東秩父村",18,0.18,2,"",2]
["市区町村","113816","埼玉県","美里町",62,0.62,2,"",2]
["市区町村","113832","埼玉県","神川町",49,0.49,2,"",2]
["市区町村","113859","埼玉県","上里町",75,0.75,2,"",2]
["市区町村","114081","埼玉県","寄居町",76,0.76,2,"",2]
["市区町村","114421","埼玉県","宮代町",59,0.59,2,"",2]
["市区町村","114642","埼玉県","杉戸町",70,0.7,2,"",2]
["市区町村","114651","埼玉県","松伏町",61,0.61,2,"",2]
["市区町村","121002","千葉県","千葉市",88,0.88,2,"",2]
["市区町村","122025","千葉県","銚子市",58,0.57999999999999996,2,"",2]
["市区町村","122033","千葉県","市川市",110,1.1000000000000001,1,"",1]
["市区町村","122041","千葉県","船橋市",91,0.91,2,"",2]
["市区町村","122050","千葉県","館山市",55,0.55000000000000004,2,"",2]
["市区町村","122068","千葉県","木更津市",85,0.85,2,"",2]
["市区町村","122076","千葉県","松戸市",84,{"$f":"IF(A628=\"都道府県\",E628/100000,IF(A628=\"市区町村\",E628/100,\"エラー\"))","v":0.84},2,"",2]
["市区町村","122084","千葉県","野田市",79,0.79,2,"",2]
["市区町村","122106","千葉県","茂原市",73,0.73,2,"",2]
["市区町村","122114","千葉県","成田市",129,1.29,1,"",1]
["市区町村","122122","千葉県","佐倉市",84,0.84,2,"",2]
["市区町村","122131","千葉県","東金市",65,0.65,2,"",2]
["市区町村","122157","千葉県","旭市",49,0.49,2,"",2]
["市区町村","122165","千葉県","習志野市",89,0.89,2,"",2]
["市区町村","122173","千葉県","柏市",91,0.91,2,"",2]
["市区町村","122181","千葉県","勝浦市",47,0.47,2,"",2]
["市区町村","122190","千葉県","市原市",109,1.0900000000000001,1,"",1]
["市区町村","122203","千葉県","流山市",93,0.93,2,"",2]
["市区町村","122211","千葉県","八千代市",91,0.91,2,"",2]
["市区町村","122220","千葉県","我孫子市",74,0.74,2,"",2]
["市区町村","122238","千葉県","鴨川市",51,0.51,2,{"$f":"IF(_xlfn.IFNA(VLOOKUP(B642,$T:$T,1,0),\"\")=\"\",\"\",\"〇\")","v":""},2]
["市区町村","122246","千葉県","鎌ケ谷市",72,0.72,{"$f":"IF(F643<>\"エラー\",IF(F643>=$N$16, 1, IF(F643<=$N$18, 3, 2)),\"エラー\")","v":2},"",{"$f":"IF(H643=\"〇\",1,G643)","v":2}]
["市区町村","122254","千葉県","君津市",101,1.01,1,"",1]
["市区町村","122262","千葉県","富津市",84,0.84,2,"",2]
["市区町村","122271","千葉県","浦安市",148,1.48,1,"",1]
["市区町村","122289","千葉県","四街道市",73,0.73,2,"",2]
["市区町村","122297","千葉県","袖ケ浦市",114,1.1399999999999999,1,"",1]
["市区町村","122301","千葉県","八街市",62,0.62,2,"",2]
["市区町村","122319","千葉県","印西市",114,1.1399999999999999,1,"",1]
["市区町村","122327","千葉県","白井市",83,0.83,2,"",2]
["市区町村","122335","千葉県","富里市",73,0.73,2,"",2]
["市区町村","122343","千葉県","南房総市",31,0.31,2,"",2]
["市区町村","122351","千葉県","匝瑳市",46,0.46,2,"",2]
["市区町村","122360","千葉県","香取市",50,0.5,2,"",2]
["市区町村","122378","千葉県","山武市",47,0.47,2,"",2]
["市区町村","122386","千葉県","いすみ市",41,0.41,2,"",2]
["市区町村","122394","千葉県","大網白里市",58,0.57999999999999996,2,"",2]
["市区町村","123226","千葉県","酒々井町",69,0.69,2,"",2]
["市区町村","123293","千葉県","栄町",50,0.5,2,"",2]
["市区町村","123421","千葉県","神崎町",38,0.38,2,"",2]
["市区町村","123471","千葉県","多古町",54,0.54,2,"",2]
["市区町村","123498","千葉県","東庄町",42,0.42,2,"",2]
["市区町村","124036","千葉県","九十九里町",42,0.42,2,"",2]
["市区町村","124095","千葉県","芝山町",108,1.08,1,"",1]
["市区町村","124109","千葉県","横芝光町",45,0.45,2,"",2]
["市区町村","124214","千葉県","一宮町",54,0.54,2,"",2]
["市区町村","124222","千葉県","睦沢町",35,0.35,2,"",2]
["市区町村","124231","千葉県","長生村",49,0.49,2,"",2]
["市区町村","124249","千葉県","白子町",45,0.45,2,"",2]
["市区町村","124265","千葉県","長柄町",50,0.5,2,"",2]
["市区町村","124273","千葉県","長南町",42,0.42,2,"",2]
["市区町村","124419","千葉県","大多喜町",40,0.4,2,"",2]
["市区町村","124435","千葉県","御宿町",40,0.4,2,"",2]
["市区町村","124630","千葉県","鋸南町",27,0.27,2,"",2]
["市区町村","131016","東京都","千代田区",85,0.85,2,"",2]
["市区町村","131024","東京都","中央区",62,0.62,2,"",2]
["市区町村","131032","東京都","港区",117,1.17,1,"",1]
["市区町村","131041","東京都","新宿区",67,0.67,2,"",2]
["市区町村","131059","東京都","文京区",62,0.62,2,"",2]
["市区町村","131067","東京都","台東区",49,0.49,2,"",2]
["市区町村","131075","東京都","墨田区",42,0.42,2,"",2]
["市区町村","131083","東京都","江東区",49,0.49,2,"",2]
["市区町村","131091","東京都","品川区",58,0.57999999999999996,2,"",2]
["市区町村","131105","東京都","目黒区",72,0.72,2,"",2]
["市区町村","131113","東京都","大田区",54,0.54,2,"",2]
["市区町村","131121","東京都","世田谷区",68,0.68,2,"",2]
["市区町村","131130","東京都","渋谷区",97,0.97,2,"",2]
["市区町村","131148","東京都","中野区",49,0.49,2,"",2]
["市区町村","131156","東京都","杉並区",59,0.59,2,"",2]
["市区町村","131164","東京都","豊島区",53,0.53,2,"",2]
["市区町村","131172","東京都","北区",39,{"$f":"IF(A692=\"都道府県\",E692/100000,IF(A692=\"市区町村\",E692/100,\"エラー\"))","v":0.39},2,"",2]
["市区町村","131181","東京都","荒川区",34,0.34,2,"",2]
["市区町村","131199","東京都","板橋区",43,0.43,2,"",2]
["市区町村","131202","東京都","練馬区",45,0.45,2,"",2]
["市区町村","131211","東京都","足立区",38,0.38,2,"",2]
["市区町村","131229","東京都","葛飾区",35,0.35,2,"",2]
["市区町村","131237","東京都","江戸川区",38,0.38,2,"",2]
["市区町村","132012","東京都","八王子市",90,0.9,2,"",2]
["市区町村","132021","東京都","立川市",120,1.2,1,"",1]
["市区町村","132039","東京都","武蔵野市",157,1.57,1,"",1]
["市区町村","132047","東京都","三鷹市",117,1.17,1,"",1]
["市区町村","132055","東京都","青梅市",78,0.78,2,"",2]
["市区町村","132063","東京都","府中市",126,1.26,1,"",1]
["市区町村","132071","東京都","昭島市",100,1,1,"",1]
["市区町村","132080","東京都","調布市",122,1.22,1,{"$f":"IF(_xlfn.IFNA(VLOOKUP(B706,$T:$T,1,0),\"\")=\"\",\"\",\"〇\")","v":""},1]
["市区町村","132098","東京都","町田市",93,0.93,{"$f":"IF(F707<>\"エラー\",IF(F707>=$N$16, 1, IF(F707<=$N$18, 3, 2)),\"エラー\")","v":2},"",{"$f":"IF(H707=\"〇\",1,G707)","v":2}]
["市区町村","132101","東京都","小金井市",102,1.02,1,"",1]
["市区町村","132110","東京都","小平市",95,0.95,2,"",2]
["市区町村","132128","東京都","日野市",91,0.91,2,"",2]
["市区町村","132136","東京都","東村山市",75,0.75,2,"",2]
["市区町村","132144","東京都","国分寺市",106,1.06,1,"",1]
["市区町村","132152","東京都","国立市",101,1.01,1,"",1]
["市区町村","132187","東京都","福生市",71,0.71,2,"",2]
["市区町村","132195","東京都","狛江市",81,0.81,2,"",2]
["市区町村","132209","東京都","東大和市",77,0.77,2,"",2]
["市区町村","132217","東京都","清瀬市",66,0.66,2,"",2]
["市区町村","132225","東京都","東久留米市",78,0.78,2,"",2]
["市区町村","132233","東京都","武蔵村山市",77,0.77,2,"",2]
["市区町村","132241","東京都","多摩市",115,1.1499999999999999,1,"",1]
["市区町村","132250","東京都","稲城市",94,0.94,2,"",2]
["市区町村","132276","東京都","羽村市",93,0.93,2,"",2]
["市区町村","132284","東京都","あきる野市",69,0.69,2,"",2]
["市区町村","132292","東京都","西東京市",89,0.89,2,"",2]
["市区町村","133035","東京都","瑞穂町",100,1,1,"",1]
["市区町村","133051","東京都","日の出町",62,0.62,2,"",2]
["市区町村","133078","東京都","檜原村",17,0.17,2,"",2]
["市区町村","133086","東京都","奥多摩町",27,0.27,2,"",2]
["市区町村","133612","東京都","大島町",27,0.27,2,"",2]
["市区町村","133621","東京都","利島村",12,0.12,2,"",2]
["市区町村","133639","東京都","新島村",18,0.18,2,"",2]
["市区町村","133647","東京都","神津島村",19,0.19,2,"",2]
["市区町村","133817","東京都","三宅村",20,0.2,2,"",2]
["市区町村","133825","東京都","御蔵島村",11,0.11,2,"",2]
["市区町村","134015","東京都","八丈町",27,0.27,2,"",2]
["市区町村","134023","東京都","青ヶ島村",16,0.16,2,"",2]
["市区町村","134210","東京都","小笠原村",25,0.25,2,"",2]
["市区町村","141003","神奈川県","横浜市",95,0.95,2,"",2]
["市区町村","141305","神奈川県","川崎市",106,1.06,1,"",1]
["市区町村","141500","神奈川県","相模原市",83,0.83,2,"",2]
["市区町村","142018","神奈川県","横須賀市",74,0.74,2,"",2]
["市区町村","142034","神奈川県","平塚市",95,0.95,2,"",2]
["市区町村","142042","神奈川県","鎌倉市",110,1.1000000000000001,1,"",1]
["市区町村","142051","神奈川県","藤沢市",108,1.08,1,"",1]
["市区町村","142069","神奈川県","小田原市",90,0.9,2,"",2]
["市区町村","142077","神奈川県","茅ヶ崎市",90,0.9,2,"",2]
["市区町村","142085","神奈川県","逗子市",78,0.78,2,"",2]
["市区町村","142107","神奈川県","三浦市",54,0.54,2,"",2]
["市区町村","142115","神奈川県","秦野市",78,0.78,2,"",2]
["市区町村","142123","神奈川県","厚木市",118,1.18,1,"",1]
["市区町村","142131","神奈川県","大和市",93,0.93,2,"",2]
["市区町村","142140","神奈川県","伊勢原市",92,0.92,2,"",2]
["市区町村","142158","神奈川県","海老名市",106,1.06,1,"",1]
["市区町村","142166","神奈川県","座間市",82,0.82,2,"",2]
["市区町村","142174","神奈川県","南足柄市",77,0.77,2,"",2]
["市区町村","142182","神奈川県","綾瀬市",86,{"$f":"IF(A756=\"都道府県\",E756/100000,IF(A756=\"市区町村\",E756/100,\"エラー\"))","v":0.86},2,"",2]
["市区町村","143014","神奈川県","葉山町",79,0.79,2,"",2]
["市区町村","143219","神奈川県","寒川町",112,1.1200000000000001,1,"",1]
["市区町村","143413","神奈川県","大磯町",73,0.73,2,"",2]
["市区町村","143421","神奈川県","二宮町",62,0.62,2,"",2]
["市区町村","143618","神奈川県","中井町",90,0.9,2,"",2]
["市区町村","143626","神奈川県","大井町",69,0.69,2,"",2]
["市区町村","143634","神奈川県","松田町",55,0.55000000000000004,2,"",2]
["市区町村","143642","神奈川県","山北町",49,0.49,2,"",2]
["市区町村","143669","神奈川県","開成町",82,0.82,2,"",2]
["市区町村","143821","神奈川県","箱根町",130,1.3,1,"",1]
["市区町村","143839","神奈川県","真鶴町",38,0.38,2,"",2]
["市区町村","143847","神奈川県","湯河原町",63,0.63,2,"",2]
["市区町村","144011","神奈川県","愛川町",97,0.97,2,"",2]
["市区町村","144029","神奈川県","清川村",73,0.73,2,{"$f":"IF(_xlfn.IFNA(VLOOKUP(B770,$T:$T,1,0),\"\")=\"\",\"\",\"〇\")","v":""},2]
["市区町村","151009","新潟県","新潟市",64,0.64,{"$f":"IF(F771<>\"エラー\",IF(F771>=$N$16, 1, IF(F771<=$N$18, 3, 2)),\"エラー\")","v":2},"",{"$f":"IF(H771=\"〇\",1,G771)","v":2}]
["市区町村","152021","新潟県","長岡市",59,0.59,2,"",2]
["市区町村","152048","新潟県","三条市",55,0.55000000000000004,2,"",2]
["市区町村","152056","新潟県","柏崎市",64,0.64,2,"",2]
["市区町村","152064","新潟県","新発田市",49,0.49,2,"",2]
["市区町村","152081","新潟県","小千谷市",52,0.52,2,"",2]
["市区町村","152099","新潟県","加茂市",41,0.41,2,"",2]
["市区町村","152102","新潟県","十日町市",33,0.33,2,"",2]
["市区町村","152111","新潟県","見附市",52,0.52,2,"",2]
["市区町村","152129","新潟県","村上市",34,0.34,2,"",2]
["市区町村","152137","新潟県","燕市",60,0.6,2,"",2]
["市区町村","152161","新潟県","糸魚川市",48,0.48,2,"",2]
["市区町村","152170","新潟県","妙高市",43,0.43,2,"",2]
["市区町村","152188","新潟県","五泉市",43,0.43,2,"",2]
["市区町村","152226","新潟県","上越市",57,0.56999999999999995,2,"",2]
["市区町村","152234","新潟県","阿賀野市",43,0.43,2,"",2]
["市区町村","152242","新潟県","佐渡市",24,0.24,2,"",2]
["市区町村","152251","新潟県","魚沼市",28,0.28000000000000003,2,"",2]
["市区町村","152269","新潟県","南魚沼市",42,0.42,2,"",2]
["市区町村","152277","新潟県","胎内市",44,0.44,2,"",2]
["市区町村","153079","新潟県","聖籠町",107,1.07,1,"",1]
["市区町村","153427","新潟県","弥彦村",38,0.38,2,"",2]
["市区町村","153613","新潟県","田上町",36,0.36,2,"",2]
["市区町村","153851","新潟県","阿賀町",20,0.2,2,"",2]
["市区町村","154059","新潟県","出雲崎町",22,0.22,2,"",2]
["市区町村","154610","新潟県","湯沢町",90,0.9,2,"",2]
["市区町村","154822","新潟県","津南町",26,0.26,2,"",2]
["市区町村","155047","新潟県","刈羽村",145,1.45,1,"",1]
["市区町村","155811","新潟県","関川村",21,0.21,2,"",2]
["市区町村","155861","新潟県","粟島浦村",9,0.09,2,"",2]
["市区町村","162019","富山県","富山市",80,0.8,2,"",2]
["市区町村","162027","富山県","高岡市",71,0.71,2,"",2]
["市区町村","162043","富山県","魚津市",66,0.66,2,"",2]
["市区町村","162051","富山県","氷見市",47,0.47,2,"",2]
["市区町村","162060","富山県","滑川市",71,0.71,2,"",2]
["市区町村","162078","富山県","黒部市",62,0.62,2,"",2]
["市区町村","162086","富山県","砺波市",57,0.56999999999999995,2,"",2]
["市区町村","162094","富山県","小矢部市",56,0.56000000000000005,2,"",2]
["市区町村","162108","富山県","南砺市",34,0.34,2,"",2]
["市区町村","162116","富山県","射水市",64,0.64,2,"",2]
["市区町村","163210","富山県","舟橋村",32,0.32,2,"",2]
["市区町村","163228","富山県","上市町",45,0.45,2,"",2]
["市区町村","163236","富山県","立山町",46,0.46,2,"",2]
["市区町村","163422","富山県","入善町",51,0.51,2,"",2]
["市区町村","163431","富山県","朝日町",33,0.33,2,"",2]
["市区町村","172014","石川県","金沢市",85,0.85,2,"",2]
["市区町村","172022","石川県","七尾市",45,0.45,2,"",2]
["市区町村","172031","石川県","小松市",65,0.65,2,"",2]
["市区町村","172049","石川県","輪島市",24,0.24,2,"",2]
["市区町村","172057","石川県","珠洲市",22,{"$f":"IF(A820=\"都道府県\",E820/100000,IF(A820=\"市区町村\",E820/100,\"エラー\"))","v":0.22},2,"",2]
["市区町村","172065","石川県","加賀市",54,0.54,2,"",2]
["市区町村","172073","石川県","羽咋市",40,0.4,2,"",2]
["市区町村","172090","石川県","かほく市",42,0.42,2,"",2]
["市区町村","172103","石川県","白山市",62,0.62,2,"",2]
["市区町村","172111","石川県","能美市",64,0.64,2,"",2]
["市区町村","172120","石川県","野々市市",78,0.78,2,"",2]
["市区町村","173240","石川県","川北町",51,0.51,2,"",2]
["市区町村","173614","石川県","津幡町",55,0.55000000000000004,2,"",2]
["市区町村","173657","石川県","内灘町",50,0.5,2,"",2]
["市区町村","173843","石川県","志賀町",53,0.53,2,"",2]
["市区町村","173860","石川県","宝達志水町",35,0.35,2,"",2]
["市区町村","174076","石川県","中能登町",30,0.3,2,"",2]
["市区町村","174611","石川県","穴水町",27,0.27,2,"",2]
["市区町村","174637","石川県","能登町",19,0.19,2,{"$f":"IF(_xlfn.IFNA(VLOOKUP(B834,$T:$T,1,0),\"\")=\"\",\"\",\"〇\")","v":""},2]
["市区町村","182010","福井県","福井市",77,0.77,{"$f":"IF(F835<>\"エラー\",IF(F835>=$N$16, 1, IF(F835<=$N$18, 3, 2)),\"エラー\")","v":2},"",{"$f":"IF(H835=\"〇\",1,G835)","v":2}]
["市区町村","182028","福井県","敦賀市",85,0.85,2,"",2]
["市区町村","182044","福井県","小浜市",44,0.44,2,"",2]
["市区町村","182052","福井県","大野市",42,0.42,2,"",2]
["市区町村","182061","福井県","勝山市",43,0.43,2,"",2]
["市区町村","182079","福井県","鯖江市",67,0.67,2,"",2]
["市区町村","182087","福井県","あわら市",55,0.55000000000000004,2,"",2]
["市区町村","182095","福井県","越前市",71,0.71,2,"",2]
["市区町村","182109","福井県","坂井市",60,0.6,2,"",2]
["市区町村","183229","福井県","永平寺町",37,0.37,2,"",2]
["市区町村","183822","福井県","池田町",14,0.14000000000000001,2,"",2]
["市区町村","184047","福井県","南越前町",27,0.27,2,"",2]
["市区町村","184233","福井県","越前町",33,0.33,2,"",2]
["市区町村","184420","福井県","美浜町",108,1.08,1,"",1]
["市区町村","184811","福井県","高浜町",165,1.65,1,"",1]
["市区町村","184837","福井県","おおい町",109,1.0900000000000001,1,"",1]
["市区町村","185019","福井県","若狭町",33,0.33,2,"",2]
["市区町村","192015","山梨県","甲府市",71,0.71,2,"",2]
["市区町村","192023","山梨県","富士吉田市",67,0.67,2,"",2]
["市区町村","192040","山梨県","都留市",45,0.45,2,"",2]
["市区町村","192058","山梨県","山梨市",42,0.42,2,"",2]
["市区町村","192066","山梨県","大月市",60,0.6,2,"",2]
["市区町村","192074","山梨県","韮崎市",75,0.75,2,"",2]
["市区町村","192082","山梨県","南アルプス市",51,0.51,2,"",2]
["市区町村","192091","山梨県","北杜市",42,0.42,2,"",2]
["市区町村","192104","山梨県","甲斐市",62,0.62,2,"",2]
["市区町村","192112","山梨県","笛吹市",52,0.52,2,"",2]
["市区町村","192121","山梨県","上野原市",48,0.48,2,"",2]
["市区町村","192139","山梨県","甲州市",43,0.43,2,"",2]
["市区町村","192147","山梨県","中央市",67,0.67,2,"",2]
["市区町村","193461","山梨県","市川三郷町",31,0.31,2,"",2]
["市区町村","193640","山梨県","早川町",28,0.28000000000000003,2,"",2]
["市区町村","193658","山梨県","身延町",26,0.26,2,"",2]
["市区町村","193666","山梨県","南部町",27,0.27,2,"",2]
["市区町村","193682","山梨県","富士川町",34,0.34,2,"",2]
["市区町村","193844","山梨県","昭和町",115,1.1499999999999999,1,"",1]
["市区町村","194221","山梨県","道志村",15,0.15,2,"",2]
["市区町村","194239","山梨県","西桂町",29,0.28999999999999998,2,"",2]
["市区町村","194247","山梨県","忍野村",115,1.1499999999999999,1,"",1]
["市区町村","194255","山梨県","山中湖村",120,1.2,1,"",1]
["市区町村","194298","山梨県","鳴沢村",52,0.52,2,"",2]
["市区町村","194301","山梨県","富士河口湖町",59,0.59,2,"",2]
["市区町村","194425","山梨県","小菅村",11,0.11,2,"",2]
["市区町村","194433","山梨県","丹波山村",7,7.0000000000000007E-2,2,"",2]
["市区町村","202011","長野県","長野市",71,0.71,2,"",2]
["市区町村","202029","長野県","松本市",70,0.7,2,"",2]
["市区町村","202037","長野県","上田市",59,0.59,2,"",2]
["市区町村","202045","長野県","岡谷市",60,0.6,2,"",2]
["市区町村","202053","長野県","飯田市",54,0.54,2,"",2]
["市区町村","202061","長野県","諏訪市",68,{"$f":"IF(A884=\"都道府県\",E884/100000,IF(A884=\"市区町村\",E884/100,\"エラー\"))","v":0.68},2,"",2]
["市区町村","202070","長野県","須坂市",55,0.55000000000000004,2,"",2]
["市区町村","202088","長野県","小諸市",58,0.57999999999999996,2,"",2]
["市区町村","202096","長野県","伊那市",48,0.48,2,"",2]
["市区町村","202100","長野県","駒ケ根市",57,0.56999999999999995,2,"",2]
["市区町村","202118","長野県","中野市",57,0.56999999999999995,2,"",2]
["市区町村","202126","長野県","大町市",44,0.44,2,"",2]
["市区町村","202134","長野県","飯山市",33,0.33,2,"",2]
["市区町村","202142","長野県","茅野市",55,0.55000000000000004,2,"",2]
["市区町村","202151","長野県","塩尻市",63,0.63,2,"",2]
["市区町村","202177","長野県","佐久市",51,0.51,2,"",2]
["市区町村","202185","長野県","千曲市",50,0.5,2,"",2]
["市区町村","202193","長野県","東御市",48,0.48,2,"",2]
["市区町村","202207","長野県","安曇野市",51,0.51,2,"",2]
["市区町村","203033","長野県","小海町",26,0.26,2,{"$f":"IF(_xlfn.IFNA(VLOOKUP(B898,$T:$T,1,0),\"\")=\"\",\"\",\"〇\")","v":""},2]
["市区町村","203041","長野県","川上村",27,0.27,{"$f":"IF(F899<>\"エラー\",IF(F899>=$N$16, 1, IF(F899<=$N$18, 3, 2)),\"エラー\")","v":2},"",{"$f":"IF(H899=\"〇\",1,G899)","v":2}]
["市区町村","203050","長野県","南牧村",28,0.28000000000000003,2,"",2]
["市区町村","203068","長野県","南相木村",56,0.56000000000000005,2,"",2]
["市区町村","203076","長野県","北相木村",14,0.14000000000000001,2,"",2]
["市区町村","203092","長野県","佐久穂町",25,0.25,2,"",2]
["市区町村","203211","長野県","軽井沢町",160,1.6,1,"",1]
["市区町村","203238","長野県","御代田町",60,0.6,2,"",2]
["市区町村","203246","長野県","立科町",32,0.32,2,"",2]
["市区町村","203491","長野県","青木村",24,0.24,2,"",2]
["市区町村","203505","長野県","長和町",22,0.22,2,"",2]
["市区町村","203611","長野県","下諏訪町",52,0.52,2,"",2]
["市区町村","203629","長野県","富士見町",53,0.53,2,"",2]
["市区町村","203637","長野県","原村",37,0.37,2,"",2]
["市区町村","203823","長野県","辰野町",47,0.47,2,"",2]
["市区町村","203831","長野県","箕輪町",56,0.56000000000000005,2,"",2]
["市区町村","203840","長野県","飯島町",37,0.37,2,"",2]
["市区町村","203858","長野県","南箕輪村",54,0.54,2,"",2]
["市区町村","203866","長野県","中川村",21,0.21,2,"",2]
["市区町村","203882","長野県","宮田村",46,0.46,2,"",2]
["市区町村","204021","長野県","松川町",39,0.39,2,"",2]
["市区町村","204030","長野県","高森町",42,0.42,2,"",2]
["市区町村","204048","長野県","阿南町",19,0.19,2,"",2]
["市区町村","204072","長野県","阿智村",25,0.25,2,"",2]
["市区町村","204099","長野県","平谷村",14,0.14000000000000001,2,"",2]
["市区町村","204102","長野県","根羽村",11,0.11,2,"",2]
["市区町村","204111","長野県","下條村",22,0.22,2,"",2]
["市区町村","204129","長野県","売木村",11,0.11,2,"",2]
["市区町村","204137","長野県","天龍村",15,0.15,2,"",2]
["市区町村","204145","長野県","泰阜村",15,0.15,2,"",2]
["市区町村","204153","長野県","喬木村",25,0.25,2,"",2]
["市区町村","204161","長野県","豊丘村",30,0.3,2,"",2]
["市区町村","204170","長野県","大鹿村",15,0.15,2,"",2]
["市区町村","204226","長野県","上松町",24,0.24,2,"",2]
["市区町村","204234","長野県","南木曽町",23,0.23,2,"",2]
["市区町村","204251","長野県","木祖村",26,0.26,2,"",2]
["市区町村","204293","長野県","王滝村",19,0.19,2,"",2]
["市区町村","204307","長野県","大桑村",24,0.24,2,"",2]
["市区町村","204323","長野県","木曽町",26,0.26,2,"",2]
["市区町村","204463","長野県","麻績村",17,0.17,2,"",2]
["市区町村","204480","長野県","生坂村",13,0.13,2,"",2]
["市区町村","204501","長野県","山形村",42,0.42,2,"",2]
["市区町村","204510","長野県","朝日村",40,0.4,2,"",2]
["市区町村","204528","長野県","筑北村",16,0.16,2,"",2]
["市区町村","204811","長野県","池田町",32,0.32,2,"",2]
["市区町村","204820","長野県","松川村",34,0.34,2,"",2]
["市区町村","204854","長野県","白馬村",43,0.43,2,"",2]
["市区町村","204862","長野県","小谷村",22,0.22,2,"",2]
["市区町村","205214","長野県","坂城町",63,0.63,2,"",2]
["市区町村","205419","長野県","小布施町",40,0.4,2,"",2]
["市区町村","205435","長野県","高山村",29,{"$f":"IF(A948=\"都道府県\",E948/100000,IF(A948=\"市区町村\",E948/100,\"エラー\"))","v":0.28999999999999998},2,"",2]
["市区町村","205613","長野県","山ノ内町",37,0.37,2,"",2]
["市区町村","205621","長野県","木島平村",20,0.2,2,"",2]
["市区町村","205630","長野県","野沢温泉村",18,0.18,2,"",2]
["市区町村","205834","長野県","信濃町",31,0.31,2,"",2]
["市区町村","205885","長野県","小川村",13,0.13,2,"",2]
["市区町村","205907","長野県","飯綱町",25,0.25,2,"",2]
["市区町村","206024","長野県","栄村",13,0.13,2,"",2]
["市区町村","212016","岐阜県","岐阜市",81,0.81,2,"",2]
["市区町村","212024","岐阜県","大垣市",84,0.84,2,"",2]
["市区町村","212032","岐阜県","高山市",54,0.54,2,"",2]
["市区町村","212041","岐阜県","多治見市",68,0.68,2,"",2]
["市区町村","212059","岐阜県","関市",59,0.59,2,"",2]
["市区町村","212067","岐阜県","中津川市",49,0.49,2,"",2]
["市区町村","212075","岐阜県","美濃市",53,0.53,2,{"$f":"IF(_xlfn.IFNA(VLOOKUP(B962,$T:$T,1,0),\"\")=\"\",\"\",\"〇\")","v":""},2]
["市区町村","212083","岐阜県","瑞浪市",59,0.59,{"$f":"IF(F963<>\"エラー\",IF(F963>=$N$16, 1, IF(F963<=$N$18, 3, 2)),\"エラー\")","v":2},"",{"$f":"IF(H963=\"〇\",1,G963)","v":2}]
["市区町村","212091","岐阜県","羽島市",73,0.73,2,"",2]
["市区町村","212105","岐阜県","恵那市",45,0.45,2,"",2]
["市区町村","212113","岐阜県","美濃加茂市",76,0.76,2,"",2]
["市区町村","212121","岐阜県","土岐市",66,0.66,2,"",2]
["市区町村","212130","岐阜県","各務原市",85,0.85,2,"",2]
["市区町村","212148","岐阜県","可児市",80,0.8,2,"",2]
["市区町村","212156","岐阜県","山県市",41,0.41,2,"",2]
["市区町村","212164","岐阜県","瑞穂市",71,0.71,2,"",2]
["市区町村","212172","岐阜県","飛騨市",34,0.34,2,"",2]
["市区町村","212181","岐阜県","本巣市",53,0.53,2,"",2]
["市区町村","212199","岐阜県","郡上市",33,0.33,2,"",2]
["市区町村","212202","岐阜県","下呂市",34,0.34,2,"",2]
["市区町村","212211","岐阜県","海津市",45,0.45,2,"",2]
["市区町村","213021","岐阜県","岐南町",88,0.88,2,"",2]
["市区町村","213039","岐阜県","笠松町",66,0.66,2,"",2]
["市区町村","213411","岐阜県","養老町",59,0.59,2,"",2]
["市区町村","213616","岐阜県","垂井町",67,0.67,2,"",2]
["市区町村","213624","岐阜県","関ケ原町",46,0.46,2,"",2]
["市区町村","213811","岐阜県","神戸町",63,0.63,2,"",2]
["市区町村","213829","岐阜県","輪之内町",57,0.56999999999999995,2,"",2]
["市区町村","213837","岐阜県","安八町",58,0.57999999999999996,2,"",2]
["市区町村","214019","岐阜県","揖斐川町",45,0.45,2,"",2]
["市区町村","214035","岐阜県","大野町",58,0.57999999999999996,2,"",2]
["市区町村","214043","岐阜県","池田町",60,0.6,2,"",2]
["市区町村","214213","岐阜県","北方町",60,0.6,2,"",2]
["市区町村","215015","岐阜県","坂祝町",48,0.48,2,"",2]
["市区町村","215023","岐阜県","富加町",42,0.42,2,"",2]
["市区町村","215031","岐阜県","川辺町",43,0.43,2,"",2]
["市区町村","215040","岐阜県","七宗町",25,0.25,2,"",2]
["市区町村","215058","岐阜県","八百津町",41,0.41,2,"",2]
["市区町村","215066","岐阜県","白川町",27,0.27,2,"",2]
["市区町村","215074","岐阜県","東白川村",16,0.16,2,"",2]
["市区町村","215210","岐阜県","御嵩町",58,0.57999999999999996,2,"",2]
["市区町村","216046","岐阜県","白川村",32,0.32,2,"",2]
["市区町村","221007","静岡県","静岡市",82,0.82,2,"",2]
["市区町村","221309","静岡県","浜松市",81,0.81,2,"",2]
["市区町村","222038","静岡県","沼津市",90,0.9,2,"",2]
["市区町村","222054","静岡県","熱海市",85,0.85,2,"",2]
["市区町村","222062","静岡県","三島市",84,0.84,2,"",2]
["市区町村","222071","静岡県","富士宮市",84,0.84,2,"",2]
["市区町村","222089","静岡県","伊東市",64,0.64,2,"",2]
["市区町村","222097","静岡県","島田市",68,0.68,2,"",2]
["市区町村","222101","静岡県","富士市",100,1,1,"",1]
["市区町村","222119","静岡県","磐田市",80,0.8,2,"",2]
["市区町村","222127","静岡県","焼津市",81,0.81,2,"",2]
["市区町村","222135","静岡県","掛川市",83,0.83,2,"",2]
["市区町村","222143","静岡県","藤枝市",81,0.81,2,"",2]
["市区町村","222151","静岡県","御殿場市",103,1.03,1,"",1]
["市区町村","222160","静岡県","袋井市",82,{"$f":"IF(A1012=\"都道府県\",E1012/100000,IF(A1012=\"市区町村\",E1012/100,\"エラー\"))","v":0.82},2,"",2]
["市区町村","222194","静岡県","下田市",46,0.46,2,"",2]
["市区町村","222208","静岡県","裾野市",94,0.94,2,"",2]
["市区町村","222216","静岡県","湖西市",101,1.01,1,"",1]
["市区町村","222224","静岡県","伊豆市",44,0.44,2,"",2]
["市区町村","222232","静岡県","御前崎市",91,0.91,2,"",2]
["市区町村","222241","静岡県","菊川市",69,0.69,2,"",2]
["市区町村","222259","静岡県","伊豆の国市",62,0.62,2,"",2]
["市区町村","222267","静岡県","牧之原市",71,0.71,2,"",2]
["市区町村","223018","静岡県","東伊豆町",54,0.54,2,"",2]
["市区町村","223026","静岡県","河津町",38,0.38,2,"",2]
["市区町村","223042","静岡県","南伊豆町",29,0.28999999999999998,2,"",2]
["市区町村","223051","静岡県","松崎町",26,0.26,2,"",2]
["市区町村","223069","静岡県","西伊豆町",26,0.26,2,"",2]
["市区町村","223255","静岡県","函南町",71,0.71,2,{"$f":"IF(_xlfn.IFNA(VLOOKUP(B1026,$T:$T,1,0),\"\")=\"\",\"\",\"〇\")","v":""},2]
["市区町村","223417","静岡県","清水町",92,0.92,{"$f":"IF(F1027<>\"エラー\",IF(F1027>=$N$16, 1, IF(F1027<=$N$18, 3, 2)),\"エラー\")","v":2},"",{"$f":"IF(H1027=\"〇\",1,G1027)","v":2}]
["市区町村","223425","静岡県","長泉町",116,1.1599999999999999,1,"",1]
["市区町村","223441","静岡県","小山町",88,0.88,2,"",2]
["市区町村","224243","静岡県","吉田町",87,0.87,2,"",2]
["市区町村","224294","静岡県","川根本町",34,0.34,2,"",2]
["市区町村","224618","静岡県","森町",54,0.54,2,"",2]
["市区町村","231002","愛知県","名古屋市",98,0.98,2,"",2]
["市区町村","232017","愛知県","豊橋市",98,0.98,2,"",2]
["市区町村","232025","愛知県","岡崎市",100,1,1,"",1]
["市区町村","232033","愛知県","一宮市",76,0.76,2,"",2]
["市区町村","232041","愛知県","瀬戸市",80,0.8,2,"",2]
["市区町村","232050","愛知県","半田市",96,0.96,2,"",2]
["市区町村","232068","愛知県","春日井市",93,0.93,2,"",2]
["市区町村","232076","愛知県","豊川市",78,0.78,2,"",2]
["市区町村","232084","愛知県","津島市",71,0.71,2,"",2]
["市区町村","232092","愛知県","碧南市",117,1.17,1,"",1]
["市区町村","232106","愛知県","刈谷市",127,1.27,1,"",1]
["市区町村","232114","愛知県","豊田市",141,1.41,1,"",1]
["市区町村","232122","愛知県","安城市",127,1.27,1,"",1]
["市区町村","232131","愛知県","西尾市",94,0.94,2,"",2]
["市区町村","232149","愛知県","蒲郡市",79,0.79,2,"",2]
["市区町村","232157","愛知県","犬山市",84,0.84,2,"",2]
["市区町村","232165","愛知県","常滑市",92,0.92,2,"",2]
["市区町村","232173","愛知県","江南市",74,0.74,2,"",2]
["市区町村","232190","愛知県","小牧市",121,1.21,1,"",1]
["市区町村","232203","愛知県","稲沢市",82,0.82,2,"",2]
["市区町村","232211","愛知県","新城市",54,0.54,2,"",2]
["市区町村","232220","愛知県","東海市",129,1.29,1,"",1]
["市区町村","232238","愛知県","大府市",114,1.1399999999999999,1,"",1]
["市区町村","232246","愛知県","知多市",91,0.91,2,"",2]
["市区町村","232254","愛知県","知立市",96,0.96,2,"",2]
["市区町村","232262","愛知県","尾張旭市",82,0.82,2,"",2]
["市区町村","232271","愛知県","高浜市",102,1.02,1,"",1]
["市区町村","232289","愛知県","岩倉市",73,0.73,2,"",2]
["市区町村","232297","愛知県","豊明市",83,0.83,2,"",2]
["市区町村","232301","愛知県","日進市",101,1.01,1,"",1]
["市区町村","232319","愛知県","田原市",95,0.95,2,"",2]
["市区町村","232327","愛知県","愛西市",59,0.59,2,"",2]
["市区町村","232335","愛知県","清須市",77,0.77,2,"",2]
["市区町村","232343","愛知県","北名古屋市",83,0.83,2,"",2]
["市区町村","232351","愛知県","弥富市",92,0.92,2,"",2]
["市区町村","232360","愛知県","みよし市",138,1.38,1,"",1]
["市区町村","232378","愛知県","あま市",67,0.67,2,"",2]
["市区町村","232386","愛知県","長久手市",106,1.06,1,"",1]
["市区町村","233021","愛知県","東郷町",84,0.84,2,"",2]
["市区町村","233421","愛知県","豊山町",109,1.0900000000000001,1,"",1]
["市区町村","233617","愛知県","大口町",120,1.2,1,"",1]
["市区町村","233625","愛知県","扶桑町",75,0.75,2,"",2]
["市区町村","234249","愛知県","大治町",77,0.77,2,"",2]
["市区町村","234257","愛知県","蟹江町",80,{"$f":"IF(A1076=\"都道府県\",E1076/100000,IF(A1076=\"市区町村\",E1076/100,\"エラー\"))","v":0.8},2,"",2]
["市区町村","234273","愛知県","飛島村",199,1.99,1,"",1]
["市区町村","234419","愛知県","阿久比町",69,0.69,2,"",2]
["市区町村","234427","愛知県","東浦町",87,0.87,2,"",2]
["市区町村","234451","愛知県","南知多町",46,0.46,2,"",2]
["市区町村","234460","愛知県","美浜町",61,0.61,2,"",2]
["市区町村","234478","愛知県","武豊町",113,1.1299999999999999,1,"",1]
["市区町村","235016","愛知県","幸田町",107,1.07,1,"",1]
["市区町村","235610","愛知県","設楽町",24,0.24,2,"",2]
["市区町村","235628","愛知県","東栄町",18,0.18,2,"",2]
["市区町村","235636","愛知県","豊根村",27,0.27,2,"",2]
["市区町村","242012","三重県","津市",66,0.66,2,"",2]
["市区町村","242021","三重県","四日市市",115,1.1499999999999999,1,"",1]
["市区町村","242039","三重県","伊勢市",57,0.56999999999999995,2,"",2]
["市区町村","242047","三重県","松阪市",59,0.59,2,{"$f":"IF(_xlfn.IFNA(VLOOKUP(B1090,$T:$T,1,0),\"\")=\"\",\"\",\"〇\")","v":""},2]
["市区町村","242055","三重県","桑名市",80,0.8,{"$f":"IF(F1091<>\"エラー\",IF(F1091>=$N$16, 1, IF(F1091<=$N$18, 3, 2)),\"エラー\")","v":2},"",{"$f":"IF(H1091=\"〇\",1,G1091)","v":2}]
["市区町村","242071","三重県","鈴鹿市",85,0.85,2,"",2]
["市区町村","242080","三重県","名張市",63,0.63,2,"",2]
["市区町村","242098","三重県","尾鷲市",34,0.34,2,"",2]
["市区町村","242101","三重県","亀山市",81,0.81,2,"",2]
["市区町村","242110","三重県","鳥羽市",41,0.41,2,"",2]
["市区町村","242128","三重県","熊野市",26,0.26,2,"",2]
["市区町村","242144","三重県","いなべ市",76,0.76,2,"",2]
["市区町村","242152","三重県","志摩市",40,0.4,2,"",2]
["市区町村","242161","三重県","伊賀市",61,0.61,2,"",2]
["市区町村","243035","三重県","木曽岬町",50,0.5,2,"",2]
["市区町村","243248","三重県","東員町",71,0.71,2,"",2]
["市区町村","243418","三重県","菰野町",74,0.74,2,"",2]
["市区町村","243434","三重県","朝日町",68,0.68,2,"",2]
["市区町村","243442","三重県","川越町",116,1.1599999999999999,1,"",1]
["市区町村","244414","三重県","多気町",49,0.49,2,"",2]
["市区町村","244422","三重県","明和町",52,0.52,2,"",2]
["市区町村","244431","三重県","大台町",24,0.24,2,"",2]
["市区町村","244619","三重県","玉城町",53,0.53,2,"",2]
["市区町村","244708","三重県","度会町",37,0.37,2,"",2]
["市区町村","244716","三重県","大紀町",19,0.19,2,"",2]
["市区町村","244724","三重県","南伊勢町",20,0.2,2,"",2]
["市区町村","245437","三重県","紀北町",27,0.27,2,"",2]
["市区町村","245615","三重県","御浜町",28,0.28000000000000003,2,"",2]
["市区町村","245623","三重県","紀宝町",28,0.28000000000000003,2,"",2]
["市区町村","252018","滋賀県","大津市",76,0.76,2,"",2]
["市区町村","252026","滋賀県","彦根市",76,0.76,2,"",2]
["市区町村","252034","滋賀県","長浜市",53,0.53,2,"",2]
["市区町村","252042","滋賀県","近江八幡市",64,0.64,2,"",2]
["市区町村","252069","滋賀県","草津市",91,0.91,2,"",2]
["市区町村","252077","滋賀県","守山市",80,0.8,2,"",2]
["市区町村","252085","滋賀県","栗東市",96,0.96,2,"",2]
["市区町村","252093","滋賀県","甲賀市",64,0.64,2,"",2]
["市区町村","252107","滋賀県","野洲市",78,0.78,2,"",2]
["市区町村","252115","滋賀県","湖南市",73,0.73,2,"",2]
["市区町村","252123","滋賀県","高島市",37,0.37,2,"",2]
["市区町村","252131","滋賀県","東近江市",60,0.6,2,"",2]
["市区町村","252140","滋賀県","米原市",52,0.52,2,"",2]
["市区町村","253839","滋賀県","日野町",66,0.66,2,"",2]
["市区町村","253847","滋賀県","竜王町",99,0.99,2,"",2]
["市区町村","254258","滋賀県","愛荘町",57,0.56999999999999995,2,"",2]
["市区町村","254410","滋賀県","豊郷町",42,0.42,2,"",2]
["市区町村","254428","滋賀県","甲良町",36,0.36,2,"",2]
["市区町村","254436","滋賀県","多賀町",56,0.56000000000000005,2,"",2]
["市区町村","261009","京都府","京都市",81,0.81,2,"",2]
["市区町村","262013","京都府","福知山市",52,0.52,2,"",2]
["市区町村","262021","京都府","舞鶴市",61,0.61,2,"",2]
["市区町村","262030","京都府","綾部市",49,0.49,2,"",2]
["市区町村","262048","京都府","宇治市",69,0.69,2,"",2]
["市区町村","262056","京都府","宮津市",37,{"$f":"IF(A1140=\"都道府県\",E1140/100000,IF(A1140=\"市区町村\",E1140/100,\"エラー\"))","v":0.37},2,"",2]
["市区町村","262064","京都府","亀岡市",58,0.57999999999999996,2,"",2]
["市区町村","262072","京都府","城陽市",59,0.59,2,"",2]
["市区町村","262081","京都府","向日市",69,0.69,2,"",2]
["市区町村","262099","京都府","長岡京市",74,0.74,2,"",2]
["市区町村","262102","京都府","八幡市",64,0.64,2,"",2]
["市区町村","262111","京都府","京田辺市",76,0.76,2,"",2]
["市区町村","262129","京都府","京丹後市",29,0.28999999999999998,2,"",2]
["市区町村","262137","京都府","南丹市",32,0.32,2,"",2]
["市区町村","262145","京都府","木津川市",59,0.59,2,"",2]
["市区町村","263036","京都府","大山崎町",73,0.73,2,"",2]
["市区町村","263222","京都府","久御山町",116,1.1599999999999999,1,"",1]
["市区町村","263435","京都府","井手町",36,0.36,2,"",2]
["市区町村","263443","京都府","宇治田原町",57,0.56999999999999995,2,"",2]
["市区町村","263648","京都府","笠置町",19,0.19,2,{"$f":"IF(_xlfn.IFNA(VLOOKUP(B1154,$T:$T,1,0),\"\")=\"\",\"\",\"〇\")","v":""},2]
["市区町村","263656","京都府","和束町",18,0.18,{"$f":"IF(F1155<>\"エラー\",IF(F1155>=$N$16, 1, IF(F1155<=$N$18, 3, 2)),\"エラー\")","v":2},"",{"$f":"IF(H1155=\"〇\",1,G1155)","v":2}]
["市区町村","263664","京都府","精華町",72,0.72,2,"",2]
["市区町村","263672","京都府","南山城村",21,0.21,2,"",2]
["市区町村","264075","京都府","京丹波町",28,0.28000000000000003,2,"",2]
["市区町村","264636","京都府","伊根町",10,0.1,2,"",2]
["市区町村","264652","京都府","与謝野町",28,0.28000000000000003,2,"",2]
["市区町村","271004","大阪府","大阪市",94,0.94,2,"",2]
["市区町村","271403","大阪府","堺市",75,0.75,2,"",2]
["市区町村","272027","大阪府","岸和田市",61,0.61,2,"",2]
["市区町村","272035","大阪府","豊中市",85,0.85,2,"",2]
["市区町村","272043","大阪府","池田市",76,0.76,2,"",2]
["市区町村","272051","大阪府","吹田市",95,0.95,2,"",2]
["市区町村","272060","大阪府","泉大津市",69,0.69,2,"",2]
["市区町村","272078","大阪府","高槻市",75,0.75,2,"",2]
["市区町村","272086","大阪府","貝塚市",63,0.63,2,"",2]
["市区町村","272094","大阪府","守口市",68,0.68,2,"",2]
["市区町村","272108","大阪府","枚方市",75,0.75,2,"",2]
["市区町村","272116","大阪府","茨木市",98,0.98,2,"",2]
["市区町村","272124","大阪府","八尾市",69,0.69,2,"",2]
["市区町村","272132","大阪府","泉佐野市",84,0.84,2,"",2]
["市区町村","272141","大阪府","富田林市",60,0.6,2,"",2]
["市区町村","272159","大阪府","寝屋川市",62,0.62,2,"",2]
["市区町村","272167","大阪府","河内長野市",57,0.56999999999999995,2,"",2]
["市区町村","272175","大阪府","松原市",58,0.57999999999999996,2,"",2]
["市区町村","272183","大阪府","大東市",69,0.69,2,"",2]
["市区町村","272191","大阪府","和泉市",69,0.69,2,"",2]
["市区町村","272205","大阪府","箕面市",89,0.89,2,"",2]
["市区町村","272213","大阪府","柏原市",58,0.57999999999999996,2,"",2]
["市区町村","272221","大阪府","羽曳野市",55,0.55000000000000004,2,"",2]
["市区町村","272230","大阪府","門真市",66,0.66,2,"",2]
["市区町村","272248","大阪府","摂津市",94,0.94,2,"",2]
["市区町村","272256","大阪府","高石市",77,0.77,2,"",2]
["市区町村","272264","大阪府","藤井寺市",59,0.59,2,"",2]
["市区町村","272272","大阪府","東大阪市",73,0.73,2,"",2]
["市区町村","272281","大阪府","泉南市",67,0.67,2,"",2]
["市区町村","272299","大阪府","四條畷市",57,0.56999999999999995,2,"",2]
["市区町村","272302","大阪府","交野市",67,0.67,2,"",2]
["市区町村","272311","大阪府","大阪狭山市",64,0.64,2,"",2]
["市区町村","272329","大阪府","阪南市",51,0.51,2,"",2]
["市区町村","273015","大阪府","島本町",69,0.69,2,"",2]
["市区町村","273210","大阪府","豊能町",39,0.39,2,"",2]
["市区町村","273228","大阪府","能勢町",33,0.33,2,"",2]
["市区町村","273414","大阪府","忠岡町",53,0.53,2,"",2]
["市区町村","273619","大阪府","熊取町",55,0.55000000000000004,2,"",2]
["市区町村","273627","大阪府","田尻町",128,1.28,1,"",1]
["市区町村","273660","大阪府","岬町",44,0.44,2,"",2]
["市区町村","273813","大阪府","太子町",45,0.45,2,"",2]
["市区町村","273821","大阪府","河南町",42,0.42,2,"",2]
["市区町村","273830","大阪府","千早赤阪村",25,0.25,2,"",2]
["市区町村","281000","兵庫県","神戸市",76,{"$f":"IF(A1204=\"都道府県\",E1204/100000,IF(A1204=\"市区町村\",E1204/100,\"エラー\"))","v":0.76},2,"",2]
["市区町村","282014","兵庫県","姫路市",85,0.85,2,"",2]
["市区町村","282022","兵庫県","尼崎市",81,0.81,2,"",2]
["市区町村","282031","兵庫県","明石市",71,0.71,2,"",2]
["市区町村","282049","兵庫県","西宮市",93,0.93,2,"",2]
["市区町村","282057","兵庫県","洲本市",47,0.47,2,"",2]
["市区町村","282065","兵庫県","芦屋市",109,1.0900000000000001,1,"",1]
["市区町村","282073","兵庫県","伊丹市",76,0.76,2,"",2]
["市区町村","282081","兵庫県","相生市",53,0.53,2,"",2]
["市区町村","282090","兵庫県","豊岡市",39,0.39,2,"",2]
["市区町村","282103","兵庫県","加古川市",84,0.84,2,"",2]
["市区町村","282120","兵庫県","赤穂市",64,0.64,2,"",2]
["市区町村","282138","兵庫県","西脇市",45,0.45,2,"",2]
["市区町村","282146","兵庫県","宝塚市",81,0.81,2,"",2]
["市区町村","282154","兵庫県","三木市",66,0.66,2,{"$f":"IF(_xlfn.IFNA(VLOOKUP(B1218,$T:$T,1,0),\"\")=\"\",\"\",\"〇\")","v":""},2]
["市区町村","282162","兵庫県","高砂市",78,0.78,{"$f":"IF(F1219<>\"エラー\",IF(F1219>=$N$16, 1, IF(F1219<=$N$18, 3, 2)),\"エラー\")","v":2},"",{"$f":"IF(H1219=\"〇\",1,G1219)","v":2}]
["市区町村","282171","兵庫県","川西市",64,0.64,2,"",2]
["市区町村","282189","兵庫県","小野市",71,0.71,2,"",2]
["市区町村","282197","兵庫県","三田市",82,0.82,2,"",2]
["市区町村","282201","兵庫県","加西市",63,0.63,2,"",2]
["市区町村","282219","兵庫県","丹波篠山市",42,0.42,2,"",2]
["市区町村","282227","兵庫県","養父市",25,0.25,2,"",2]
["市区町村","282235","兵庫県","丹波市",44,0.44,2,"",2]
["市区町村","282243","兵庫県","南あわじ市",40,0.4,2,"",2]
["市区町村","282251","兵庫県","朝来市",39,0.39,2,"",2]
["市区町村","282260","兵庫県","淡路市",37,0.37,2,"",2]
["市区町村","282278","兵庫県","宍粟市",34,0.34,2,"",2]
["市区町村","282286","兵庫県","加東市",62,0.62,2,"",2]
["市区町村","282294","兵庫県","たつの市",52,0.52,2,"",2]
["市区町村","283011","兵庫県","猪名川町",63,0.63,2,"",2]
["市区町村","283657","兵庫県","多可町",35,0.35,2,"",2]
["市区町村","283819","兵庫県","稲美町",65,0.65,2,"",2]
["市区町村","283827","兵庫県","播磨町",80,0.8,2,"",2]
["市区町村","284424","兵庫県","市川町",36,0.36,2,"",2]
["市区町村","284432","兵庫県","福崎町",67,0.67,2,"",2]
["市区町村","284467","兵庫県","神河町",35,0.35,2,"",2]
["市区町村","284645","兵庫県","太子町",62,0.62,2,"",2]
["市区町村","284815","兵庫県","上郡町",51,0.51,2,"",2]
["市区町村","285013","兵庫県","佐用町",28,0.28000000000000003,2,"",2]
["市区町村","285854","兵庫県","香美町",23,0.23,2,"",2]
["市区町村","285862","兵庫県","新温泉町",24,0.24,2,"",2]
["市区町村","292010","奈良県","奈良市",69,0.69,2,"",2]
["市区町村","292028","奈良県","大和高田市",46,0.46,2,"",2]
["市区町村","292036","奈良県","大和郡山市",63,0.63,2,"",2]
["市区町村","292044","奈良県","天理市",57,0.56999999999999995,2,"",2]
["市区町村","292052","奈良県","橿原市",69,0.69,2,"",2]
["市区町村","292061","奈良県","桜井市",51,0.51,2,"",2]
["市区町村","292079","奈良県","五條市",34,0.34,2,"",2]
["市区町村","292087","奈良県","御所市",38,0.38,2,"",2]
["市区町村","292095","奈良県","生駒市",72,0.72,2,"",2]
["市区町村","292109","奈良県","香芝市",64,0.64,2,"",2]
["市区町村","292117","奈良県","葛城市",49,0.49,2,"",2]
["市区町村","292125","奈良県","宇陀市",28,0.28000000000000003,2,"",2]
["市区町村","293229","奈良県","山添村",24,0.24,2,"",2]
["市区町村","293423","奈良県","平群町",41,0.41,2,"",2]
["市区町村","293431","奈良県","三郷町",43,0.43,2,"",2]
["市区町村","293440","奈良県","斑鳩町",50,0.5,2,"",2]
["市区町村","293458","奈良県","安堵町",38,0.38,2,"",2]
["市区町村","293610","奈良県","川西町",43,0.43,2,"",2]
["市区町村","293628","奈良県","三宅町",26,0.26,2,"",2]
["市区町村","293636","奈良県","田原本町",55,0.55000000000000004,2,"",2]
["市区町村","293857","奈良県","曽爾村",12,0.12,2,"",2]
["市区町村","293865","奈良県","御杖村",13,0.13,2,"",2]
["市区町村","294012","奈良県","高取町",29,0.28999999999999998,2,"",2]
["市区町村","294021","奈良県","明日香村",22,{"$f":"IF(A1268=\"都道府県\",E1268/100000,IF(A1268=\"市区町村\",E1268/100,\"エラー\"))","v":0.22},2,"",2]
["市区町村","294241","奈良県","上牧町",46,0.46,2,"",2]
["市区町村","294250","奈良県","王寺町",57,0.56999999999999995,2,"",2]
["市区町村","294268","奈良県","広陵町",57,0.56999999999999995,2,"",2]
["市区町村","294276","奈良県","河合町",45,0.45,2,"",2]
["市区町村","294411","奈良県","吉野町",25,0.25,2,"",2]
["市区町村","294420","奈良県","大淀町",42,0.42,2,"",2]
["市区町村","294438","奈良県","下市町",20,0.2,2,"",2]
["市区町村","294446","奈良県","黒滝村",12,0.12,2,"",2]
["市区町村","294462","奈良県","天川村",14,0.14000000000000001,2,"",2]
["市区町村","294471","奈良県","野迫川村",13,0.13,2,"",2]
["市区町村","294497","奈良県","十津川村",24,0.24,2,"",2]
["市区町村","294501","奈良県","下北山村",21,0.21,2,"",2]
["市区町村","294519","奈良県","上北山村",13,0.13,2,"",2]
["市区町村","294527","奈良県","川上村",28,0.28000000000000003,2,{"$f":"IF(_xlfn.IFNA(VLOOKUP(B1282,$T:$T,1,0),\"\")=\"\",\"\",\"〇\")","v":""},2]
["市区町村","294535","奈良県","東吉野村",14,0.14000000000000001,{"$f":"IF(F1283<>\"エラー\",IF(F1283>=$N$16, 1, IF(F1283<=$N$18, 3, 2)),\"エラー\")","v":2},"",{"$f":"IF(H1283=\"〇\",1,G1283)","v":2}]
["市区町村","302015","和歌山県","和歌山市",76,0.76,2,"",2]
["市区町村","302023","和歌山県","海南市",51,0.51,2,"",2]
["市区町村","302031","和歌山県","橋本市",45,0.45,2,"",2]
["市区町村","302040","和歌山県","有田市",51,0.51,2,"",2]
["市区町村","302058","和歌山県","御坊市",50,0.5,2,"",2]
["市区町村","302066","和歌山県","田辺市",39,0.39,2,"",2]
["市区町村","302074","和歌山県","新宮市",36,0.36,2,"",2]
["市区町村","302082","和歌山県","紀の川市",42,0.42,2,"",2]
["市区町村","302091","和歌山県","岩出市",61,0.61,2,"",2]
["市区町村","303046","和歌山県","紀美野町",21,0.21,2,"",2]
["市区町村","303411","和歌山県","かつらぎ町",34,0.34,2,"",2]
["市区町村","303437","和歌山県","九度山町",19,0.19,2,"",2]
["市区町村","303445","和歌山県","高野町",19,0.19,2,"",2]
["市区町村","303615","和歌山県","湯浅町",32,0.32,2,"",2]
["市区町村","303623","和歌山県","広川町",29,0.28999999999999998,2,"",2]
["市区町村","303666","和歌山県","有田川町",36,0.36,2,"",2]
["市区町村","303810","和歌山県","美浜町",27,0.27,2,"",2]
["市区町村","303828","和歌山県","日高町",29,0.28999999999999998,2,"",2]
["市区町村","303836","和歌山県","由良町",25,0.25,2,"",2]
["市区町村","303909","和歌山県","印南町",33,0.33,2,"",2]
["市区町村","303917","和歌山県","みなべ町",33,0.33,2,"",2]
["市区町村","303925","和歌山県","日高川町",25,0.25,2,"",2]
["市区町村","304018","和歌山県","白浜町",44,0.44,2,"",2]
["市区町村","304042","和歌山県","上富田町",50,0.5,2,"",2]
["市区町村","304069","和歌山県","すさみ町",21,0.21,2,"",2]
["市区町村","304212","和歌山県","那智勝浦町",30,0.3,2,"",2]
["市区町村","304221","和歌山県","太地町",15,0.15,2,"",2]
["市区町村","304247","和歌山県","古座川町",16,0.16,2,"",2]
["市区町村","304271","和歌山県","北山村",13,0.13,2,"",2]
["市区町村","304280","和歌山県","串本町",26,0.26,2,"",2]
["市区町村","312011","鳥取県","鳥取市",51,0.51,2,"",2]
["市区町村","312029","鳥取県","米子市",65,0.65,2,"",2]
["市区町村","312037","鳥取県","倉吉市",44,0.44,2,"",2]
["市区町村","312045","鳥取県","境港市",55,0.55000000000000004,2,"",2]
["市区町村","313025","鳥取県","岩美町",26,0.26,2,"",2]
["市区町村","313254","鳥取県","若桜町",14,0.14000000000000001,2,"",2]
["市区町村","313289","鳥取県","智頭町",19,0.19,2,"",2]
["市区町村","313297","鳥取県","八頭町",23,0.23,2,"",2]
["市区町村","313645","鳥取県","三朝町",22,0.22,2,"",2]
["市区町村","313700","鳥取県","湯梨浜町",27,0.27,2,"",2]
["市区町村","313718","鳥取県","琴浦町",30,0.3,2,"",2]
["市区町村","313726","鳥取県","北栄町",30,0.3,2,"",2]
["市区町村","313840","鳥取県","日吉津村",49,0.49,2,"",2]
["市区町村","313866","鳥取県","大山町",27,0.27,2,"",2]
["市区町村","313891","鳥取県","南部町",26,0.26,2,"",2]
["市区町村","313904","鳥取県","伯耆町",28,0.28000000000000003,2,"",2]
["市区町村","314013","鳥取県","日南町",16,0.16,2,"",2]
["市区町村","314021","鳥取県","日野町",16,0.16,2,"",2]
["市区町村","314030","鳥取県","江府町",27,{"$f":"IF(A1332=\"都道府県\",E1332/100000,IF(A1332=\"市区町村\",E1332/100,\"エラー\"))","v":0.27},2,"",2]
["市区町村","322016","島根県","松江市",57,0.56999999999999995,2,"",2]
["市区町村","322024","島根県","浜田市",45,0.45,2,"",2]
["市区町村","322032","島根県","出雲市",56,0.56000000000000005,2,"",2]
["市区町村","322041","島根県","益田市",40,0.4,2,"",2]
["市区町村","322059","島根県","大田市",31,0.31,2,"",2]
["市区町村","322067","島根県","安来市",35,0.35,2,"",2]
["市区町村","322075","島根県","江津市",34,0.34,2,"",2]
["市区町村","322091","島根県","雲南市",26,0.26,2,"",2]
["市区町村","323438","島根県","奥出雲町",18,0.18,2,"",2]
["市区町村","323861","島根県","飯南町",13,0.13,2,"",2]
["市区町村","324418","島根県","川本町",15,0.15,2,"",2]
["市区町村","324485","島根県","美郷町",14,0.14000000000000001,2,"",2]
["市区町村","324493","島根県","邑南町",19,0.19,2,"",2]
["市区町村","325015","島根県","津和野町",16,0.16,2,{"$f":"IF(_xlfn.IFNA(VLOOKUP(B1346,$T:$T,1,0),\"\")=\"\",\"\",\"〇\")","v":""},2]
["市区町村","325058","島根県","吉賀町",16,0.16,{"$f":"IF(F1347<>\"エラー\",IF(F1347>=$N$16, 1, IF(F1347<=$N$18, 3, 2)),\"エラー\")","v":2},"",{"$f":"IF(H1347=\"〇\",1,G1347)","v":2}]
["市区町村","325252","島根県","海士町",10,0.1,2,"",2]
["市区町村","325261","島根県","西ノ島町",10,0.1,2,"",2]
["市区町村","325279","島根県","知夫村",7,7.0000000000000007E-2,2,"",2]
["市区町村","325287","島根県","隠岐の島町",20,0.2,2,"",2]
["市区町村","331007","岡山県","岡山市",74,0.74,2,"",2]
["市区町村","332020","岡山県","倉敷市",82,0.82,2,"",2]
["市区町村","332038","岡山県","津山市",52,0.52,2,"",2]
["市区町村","332046","岡山県","玉野市",51,0.51,2,"",2]
["市区町村","332054","岡山県","笠岡市",56,0.56000000000000005,2,"",2]
["市区町村","332071","岡山県","井原市",40,0.4,2,"",2]
["市区町村","332089","岡山県","総社市",56,0.56000000000000005,2,"",2]
["市区町村","332097","岡山県","高梁市",30,0.3,2,"",2]
["市区町村","332101","岡山県","新見市",26,0.26,2,"",2]
["市区町村","332119","岡山県","備前市",42,0.42,2,"",2]
["市区町村","332127","岡山県","瀬戸内市",54,0.54,2,"",2]
["市区町村","332135","岡山県","赤磐市",44,0.44,2,"",2]
["市区町村","332143","岡山県","真庭市",30,0.3,2,"",2]
["市区町村","332151","岡山県","美作市",29,0.28999999999999998,2,"",2]
["市区町村","332160","岡山県","浅口市",42,0.42,2,"",2]
["市区町村","333468","岡山県","和気町",34,0.34,2,"",2]
["市区町村","334235","岡山県","早島町",65,0.65,2,"",2]
["市区町村","334456","岡山県","里庄町",50,0.5,2,"",2]
["市区町村","334618","岡山県","矢掛町",32,0.32,2,"",2]
["市区町村","335860","岡山県","新庄村",18,0.18,2,"",2]
["市区町村","336068","岡山県","鏡野町",30,0.3,2,"",2]
["市区町村","336220","岡山県","勝央町",48,0.48,2,"",2]
["市区町村","336238","岡山県","奈義町",30,0.3,2,"",2]
["市区町村","336432","岡山県","西粟倉村",12,0.12,2,"",2]
["市区町村","336637","岡山県","久米南町",22,0.22,2,"",2]
["市区町村","336661","岡山県","美咲町",27,0.27,2,"",2]
["市区町村","336815","岡山県","吉備中央町",28,0.28000000000000003,2,"",2]
["市区町村","341002","広島県","広島市",77,0.77,2,"",2]
["市区町村","342025","広島県","呉市",57,0.56999999999999995,2,"",2]
["市区町村","342033","広島県","竹原市",68,0.68,2,"",2]
["市区町村","342041","広島県","三原市",53,0.53,2,"",2]
["市区町村","342050","広島県","尾道市",52,0.52,2,"",2]
["市区町村","342076","広島県","福山市",76,0.76,2,"",2]
["市区町村","342084","広島県","府中市",44,0.44,2,"",2]
["市区町村","342092","広島県","三次市",34,0.34,2,"",2]
["市区町村","342106","広島県","庄原市",26,0.26,2,"",2]
["市区町村","342114","広島県","大竹市",72,0.72,2,"",2]
["市区町村","342122","広島県","東広島市",86,0.86,2,"",2]
["市区町村","342131","広島県","廿日市市",58,0.57999999999999996,2,"",2]
["市区町村","342149","広島県","安芸高田市",34,0.34,2,"",2]
["市区町村","342157","広島県","江田島市",30,0.3,2,"",2]
["市区町村","343021","広島県","府中町",76,0.76,2,"",2]
["市区町村","343048","広島県","海田町",79,0.79,2,"",2]
["市区町村","343072","広島県","熊野町",48,0.48,2,"",2]
["市区町村","343099","広島県","坂町",58,{"$f":"IF(A1396=\"都道府県\",E1396/100000,IF(A1396=\"市区町村\",E1396/100,\"エラー\"))","v":0.57999999999999996},2,"",2]
["市区町村","343684","広島県","安芸太田町",20,0.2,2,"",2]
["市区町村","343692","広島県","北広島町",36,0.36,2,"",2]
["市区町村","344311","広島県","大崎上島町",29,0.28999999999999998,2,"",2]
["市区町村","344621","広島県","世羅町",32,0.32,2,"",2]
["市区町村","345458","広島県","神石高原町",20,0.2,2,"",2]
["市区町村","352012","山口県","下関市",56,0.56000000000000005,2,"",2]
["市区町村","352021","山口県","宇部市",70,0.7,2,"",2]
["市区町村","352039","山口県","山口市",62,0.62,2,"",2]
["市区町村","352047","山口県","萩市",32,0.32,2,"",2]
["市区町村","352063","山口県","防府市",75,0.75,2,"",2]
["市区町村","352071","山口県","下松市",83,0.83,2,"",2]
["市区町村","352080","山口県","岩国市",54,0.54,2,"",2]
["市区町村","352101","山口県","光市",62,0.62,2,"",2]
["市区町村","352110","山口県","長門市",32,0.32,2,{"$f":"IF(_xlfn.IFNA(VLOOKUP(B1410,$T:$T,1,0),\"\")=\"\",\"\",\"〇\")","v":""},2]
["市区町村","352128","山口県","柳井市",50,0.5,{"$f":"IF(F1411<>\"エラー\",IF(F1411>=$N$16, 1, IF(F1411<=$N$18, 3, 2)),\"エラー\")","v":2},"",{"$f":"IF(H1411=\"〇\",1,G1411)","v":2}]
["市区町村","352136","山口県","美祢市",40,0.4,2,"",2]
["市区町村","352152","山口県","周南市",77,0.77,2,"",2]
["市区町村","352161","山口県","山陽小野田市",54,0.54,2,"",2]
["市区町村","353051","山口県","周防大島町",24,0.24,2,"",2]
["市区町村","353213","山口県","和木町",61,0.61,2,"",2]
["市区町村","353418","山口県","上関町",11,0.11,2,"",2]
["市区町村","353434","山口県","田布施町",44,0.44,2,"",2]
["市区町村","353442","山口県","平生町",40,0.4,2,"",2]
["市区町村","355020","山口県","阿武町",16,0.16,2,"",2]
["市区町村","362018","徳島県","徳島市",77,0.77,2,"",2]
["市区町村","362026","徳島県","鳴門市",63,0.63,2,"",2]
["市区町村","362034","徳島県","小松島市",56,0.56000000000000005,2,"",2]
["市区町村","362042","徳島県","阿南市",75,0.75,2,"",2]
["市区町村","362051","徳島県","吉野川市",37,0.37,2,"",2]
["市区町村","362069","徳島県","阿波市",36,0.36,2,"",2]
["市区町村","362077","徳島県","美馬市",31,0.31,2,"",2]
["市区町村","362085","徳島県","三好市",24,0.24,2,"",2]
["市区町村","363014","徳島県","勝浦町",23,0.23,2,"",2]
["市区町村","363022","徳島県","上勝町",15,0.15,2,"",2]
["市区町村","363219","徳島県","佐那河内村",15,0.15,2,"",2]
["市区町村","363413","徳島県","石井町",49,0.49,2,"",2]
["市区町村","363421","徳島県","神山町",19,0.19,2,"",2]
["市区町村","363685","徳島県","那賀町",21,0.21,2,"",2]
["市区町村","363839","徳島県","牟岐町",16,0.16,2,"",2]
["市区町村","363871","徳島県","美波町",16,0.16,2,"",2]
["市区町村","363880","徳島県","海陽町",20,0.2,2,"",2]
["市区町村","364011","徳島県","松茂町",82,0.82,2,"",2]
["市区町村","364029","徳島県","北島町",71,0.71,2,"",2]
["市区町村","364037","徳島県","藍住町",66,0.66,2,"",2]
["市区町村","364045","徳島県","板野町",46,0.46,2,"",2]
["市区町村","364053","徳島県","上板町",38,0.38,2,"",2]
["市区町村","364681","徳島県","つるぎ町",18,0.18,2,"",2]
["市区町村","364894","徳島県","東みよし町",29,0.28999999999999998,2,"",2]
["市区町村","372013","香川県","高松市",76,0.76,2,"",2]
["市区町村","372021","香川県","丸亀市",60,0.6,2,"",2]
["市区町村","372030","香川県","坂出市",78,0.78,2,"",2]
["市区町村","372048","香川県","善通寺市",51,0.51,2,"",2]
["市区町村","372056","香川県","観音寺市",59,0.59,2,"",2]
["市区町村","372064","香川県","さぬき市",39,0.39,2,"",2]
["市区町村","372072","香川県","東かがわ市",35,0.35,2,"",2]
["市区町村","372081","香川県","三豊市",42,0.42,2,"",2]
["市区町村","373222","香川県","土庄町",31,0.31,2,"",2]
["市区町村","373249","香川県","小豆島町",29,0.28999999999999998,2,"",2]
["市区町村","373419","香川県","三木町",53,0.53,2,"",2]
["市区町村","373648","香川県","直島町",43,0.43,2,"",2]
["市区町村","373869","香川県","宇多津町",78,0.78,2,"",2]
["市区町村","373877","香川県","綾川町",49,0.49,2,"",2]
["市区町村","374032","香川県","琴平町",35,0.35,2,"",2]
["市区町村","374041","香川県","多度津町",58,{"$f":"IF(A1460=\"都道府県\",E1460/100000,IF(A1460=\"市区町村\",E1460/100,\"エラー\"))","v":0.57999999999999996},2,"",2]
["市区町村","374067","香川県","まんのう町",34,0.34,2,"",2]
["市区町村","382019","愛媛県","松山市",74,0.74,2,"",2]
["市区町村","382027","愛媛県","今治市",53,0.53,2,"",2]
["市区町村","382035","愛媛県","宇和島市",34,0.34,2,"",2]
["市区町村","382043","愛媛県","八幡浜市",32,0.32,2,"",2]
["市区町村","382051","愛媛県","新居浜市",77,0.77,2,"",2]
["市区町村","382060","愛媛県","西条市",63,0.63,2,"",2]
["市区町村","382078","愛媛県","大洲市",35,0.35,2,"",2]
["市区町村","382108","愛媛県","伊予市",41,0.41,2,"",2]
["市区町村","382132","愛媛県","四国中央市",72,0.72,2,"",2]
["市区町村","382141","愛媛県","西予市",25,0.25,2,"",2]
["市区町村","382159","愛媛県","東温市",49,0.49,2,"",2]
["市区町村","383562","愛媛県","上島町",15,0.15,2,"",2]
["市区町村","383864","愛媛県","久万高原町",21,0.21,2,{"$f":"IF(_xlfn.IFNA(VLOOKUP(B1474,$T:$T,1,0),\"\")=\"\",\"\",\"〇\")","v":""},2]
["市区町村","384011","愛媛県","松前町",68,0.68,{"$f":"IF(F1475<>\"エラー\",IF(F1475>=$N$16, 1, IF(F1475<=$N$18, 3, 2)),\"エラー\")","v":2},"",{"$f":"IF(H1475=\"〇\",1,G1475)","v":2}]
["市区町村","384020","愛媛県","砥部町",42,0.42,2,"",2]
["市区町村","384224","愛媛県","内子町",27,0.27,2,"",2]
["市区町村","384429","愛媛県","伊方町",60,0.6,2,"",2]
["市区町村","384844","愛媛県","松野町",15,0.15,2,"",2]
["市区町村","384887","愛媛県","鬼北町",23,0.23,2,"",2]
["市区町村","385069","愛媛県","愛南町",23,0.23,2,"",2]
["市区町村","392014","高知県","高知市",63,0.63,2,"",2]
["市区町村","392022","高知県","室戸市",22,0.22,2,"",2]
["市区町村","392031","高知県","安芸市",31,0.31,2,"",2]
["市区町村","392049","高知県","南国市",59,0.59,2,"",2]
["市区町村","392057","高知県","土佐市",38,0.38,2,"",2]
["市区町村","392065","高知県","須崎市",41,0.41,2,"",2]
["市区町村","392081","高知県","宿毛市",36,0.36,2,"",2]
["市区町村","392090","高知県","土佐清水市",24,0.24,2,"",2]
["市区町村","392103","高知県","四万十市",35,0.35,2,"",2]
["市区町村","392111","高知県","香南市",34,0.34,2,"",2]
["市区町村","392120","高知県","香美市",32,0.32,2,"",2]
["市区町村","393011","高知県","東洋町",11,0.11,2,"",2]
["市区町村","393029","高知県","奈半利町",17,0.17,2,"",2]
["市区町村","393037","高知県","田野町",19,0.19,2,"",2]
["市区町村","393045","高知県","安田町",15,0.15,2,"",2]
["市区町村","393053","高知県","北川村",19,0.19,2,"",2]
["市区町村","393061","高知県","馬路村",16,0.16,2,"",2]
["市区町村","393070","高知県","芸西村",23,0.23,2,"",2]
["市区町村","393410","高知県","本山町",16,0.16,2,"",2]
["市区町村","393444","高知県","大豊町",18,0.18,2,"",2]
["市区町村","393631","高知県","土佐町",20,0.2,2,"",2]
["市区町村","393649","高知県","大川村",13,0.13,2,"",2]
["市区町村","393860","高知県","いの町",35,0.35,2,"",2]
["市区町村","393878","高知県","仁淀川町",18,0.18,2,"",2]
["市区町村","394017","高知県","中土佐町",17,0.17,2,"",2]
["市区町村","394025","高知県","佐川町",32,0.32,2,"",2]
["市区町村","394033","高知県","越知町",19,0.19,2,"",2]
["市区町村","394050","高知県","梼原町",14,0.14000000000000001,2,"",2]
["市区町村","394106","高知県","日高村",27,0.27,2,"",2]
["市区町村","394114","高知県","津野町",16,0.16,2,"",2]
["市区町村","394122","高知県","四万十町",23,0.23,2,"",2]
["市区町村","394246","高知県","大月町",18,0.18,2,"",2]
["市区町村","394271","高知県","三原村",12,0.12,2,"",2]
["市区町村","394289","高知県","黒潮町",20,0.2,2,"",2]
["市区町村","401005","福岡県","北九州市",69,0.69,2,"",2]
["市区町村","401307","福岡県","福岡市",87,0.87,2,"",2]
["市区町村","402028","福岡県","大牟田市",53,0.53,2,"",2]
["市区町村","402036","福岡県","久留米市",64,0.64,2,"",2]
["市区町村","402044","福岡県","直方市",56,0.56000000000000005,2,"",2]
["市区町村","402052","福岡県","飯塚市",50,0.5,2,"",2]
["市区町村","402061","福岡県","田川市",43,0.43,2,"",2]
["市区町村","402079","福岡県","柳川市",46,0.46,2,"",2]
["市区町村","402109","福岡県","八女市",38,{"$f":"IF(A1524=\"都道府県\",E1524/100000,IF(A1524=\"市区町村\",E1524/100,\"エラー\"))","v":0.38},2,"",2]
["市区町村","402117","福岡県","筑後市",67,0.67,2,"",2]
["市区町村","402125","福岡県","大川市",50,0.5,2,"",2]
["市区町村","402133","福岡県","行橋市",63,0.63,2,"",2]
["市区町村","402141","福岡県","豊前市",53,0.53,2,"",2]
["市区町村","402150","福岡県","中間市",46,0.46,2,"",2]
["市区町村","402168","福岡県","小郡市",63,0.63,2,"",2]
["市区町村","402176","福岡県","筑紫野市",74,0.74,2,"",2]
["市区町村","402184","福岡県","春日市",73,0.73,2,"",2]
["市区町村","402192","福岡県","大野城市",77,0.77,2,"",2]
["市区町村","402206","福岡県","宗像市",57,0.56999999999999995,2,"",2]
["市区町村","402214","福岡県","太宰府市",63,0.63,2,"",2]
["市区町村","402231","福岡県","古賀市",67,0.67,2,"",2]
["市区町村","402249","福岡県","福津市",56,0.56000000000000005,2,"",2]
["市区町村","402257","福岡県","うきは市",38,0.38,2,{"$f":"IF(_xlfn.IFNA(VLOOKUP(B1538,$T:$T,1,0),\"\")=\"\",\"\",\"〇\")","v":""},2]
["市区町村","402265","福岡県","宮若市",61,0.61,{"$f":"IF(F1539<>\"エラー\",IF(F1539>=$N$16, 1, IF(F1539<=$N$18, 3, 2)),\"エラー\")","v":2},"",{"$f":"IF(H1539=\"〇\",1,G1539)","v":2}]
["市区町村","402273","福岡県","嘉麻市",28,0.28000000000000003,2,"",2]
["市区町村","402281","福岡県","朝倉市",50,0.5,2,"",2]
["市区町村","402290","福岡県","みやま市",40,0.4,2,"",2]
["市区町村","402303","福岡県","糸島市",57,0.56999999999999995,2,"",2]
["市区町村","402311","福岡県","那珂川市",68,0.68,2,"",2]
["市区町村","403415","福岡県","宇美町",59,0.59,2,"",2]
["市区町村","403423","福岡県","篠栗町",60,0.6,2,"",2]
["市区町村","403431","福岡県","志免町",72,0.72,2,"",2]
["市区町村","403440","福岡県","須恵町",63,0.63,2,"",2]
["市区町村","403458","福岡県","新宮町",83,0.83,2,"",2]
["市区町村","403482","福岡県","久山町",75,0.75,2,"",2]
["市区町村","403491","福岡県","粕屋町",85,0.85,2,"",2]
["市区町村","403814","福岡県","芦屋町",34,0.34,2,"",2]
["市区町村","403822","福岡県","水巻町",50,0.5,2,"",2]
["市区町村","403831","福岡県","岡垣町",53,0.53,2,"",2]
["市区町村","403849","福岡県","遠賀町",54,0.54,2,"",2]
["市区町村","404012","福岡県","小竹町",32,0.32,2,"",2]
["市区町村","404021","福岡県","鞍手町",41,0.41,2,"",2]
["市区町村","404217","福岡県","桂川町",39,0.39,2,"",2]
["市区町村","404471","福岡県","筑前町",48,0.48,2,"",2]
["市区町村","404489","福岡県","東峰村",12,0.12,2,"",2]
["市区町村","405035","福岡県","大刀洗町",46,0.46,2,"",2]
["市区町村","405221","福岡県","大木町",47,0.47,2,"",2]
["市区町村","405442","福岡県","広川町",60,0.6,2,"",2]
["市区町村","406015","福岡県","香春町",29,0.28999999999999998,2,"",2]
["市区町村","406023","福岡県","添田町",23,0.23,2,"",2]
["市区町村","406040","福岡県","糸田町",22,0.22,2,"",2]
["市区町村","406058","福岡県","川崎町",29,0.28999999999999998,2,"",2]
["市区町村","406082","福岡県","大任町",16,0.16,2,"",2]
["市区町村","406091","福岡県","赤村",15,0.15,2,"",2]
["市区町村","406104","福岡県","福智町",27,0.27,2,"",2]
["市区町村","406210","福岡県","苅田町",131,1.31,1,"",1]
["市区町村","406252","福岡県","みやこ町",35,0.35,2,"",2]
["市区町村","406422","福岡県","吉富町",37,0.37,2,"",2]
["市区町村","406465","福岡県","上毛町",28,0.28000000000000003,2,"",2]
["市区町村","406473","福岡県","築上町",32,0.32,2,"",2]
["市区町村","412015","佐賀県","佐賀市",63,0.63,2,"",2]
["市区町村","412023","佐賀県","唐津市",43,0.43,2,"",2]
["市区町村","412031","佐賀県","鳥栖市",91,0.91,2,"",2]
["市区町村","412040","佐賀県","多久市",35,0.35,2,"",2]
["市区町村","412058","佐賀県","伊万里市",59,0.59,2,"",2]
["市区町村","412066","佐賀県","武雄市",49,0.49,2,"",2]
["市区町村","412074","佐賀県","鹿島市",47,0.47,2,"",2]
["市区町村","412082","佐賀県","小城市",42,0.42,2,"",2]
["市区町村","412091","佐賀県","嬉野市",39,0.39,2,"",2]
["市区町村","412104","佐賀県","神埼市",43,0.43,2,"",2]
["市区町村","413275","佐賀県","吉野ヶ里町",52,0.52,2,"",2]
["市区町村","413411","佐賀県","基山町",63,0.63,2,"",2]
["市区町村","413453","佐賀県","上峰町",52,{"$f":"IF(A1588=\"都道府県\",E1588/100000,IF(A1588=\"市区町村\",E1588/100,\"エラー\"))","v":0.52},2,"",2]
["市区町村","413461","佐賀県","みやき町",42,0.42,2,"",2]
["市区町村","413879","佐賀県","玄海町",142,1.42,1,"",1]
["市区町村","414018","佐賀県","有田町",35,0.35,2,"",2]
["市区町村","414239","佐賀県","大町町",29,0.28999999999999998,2,"",2]
["市区町村","414247","佐賀県","江北町",38,0.38,2,"",2]
["市区町村","414255","佐賀県","白石町",33,0.33,2,"",2]
["市区町村","414417","佐賀県","太良町",26,0.26,2,"",2]
["市区町村","422011","長崎県","長崎市",57,0.56999999999999995,2,"",2]
["市区町村","422029","長崎県","佐世保市",53,0.53,2,"",2]
["市区町村","422037","長崎県","島原市",42,0.42,2,"",2]
["市区町村","422045","長崎県","諫早市",63,0.63,2,"",2]
["市区町村","422053","長崎県","大村市",63,0.63,2,"",2]
["市区町村","422070","長崎県","平戸市",24,0.24,2,"",2]
["市区町村","422088","長崎県","松浦市",51,0.51,2,{"$f":"IF(_xlfn.IFNA(VLOOKUP(B1602,$T:$T,1,0),\"\")=\"\",\"\",\"〇\")","v":""},2]
["市区町村","422096","長崎県","対馬市",20,0.2,{"$f":"IF(F1603<>\"エラー\",IF(F1603>=$N$16, 1, IF(F1603<=$N$18, 3, 2)),\"エラー\")","v":2},"",{"$f":"IF(H1603=\"〇\",1,G1603)","v":2}]
["市区町村","422100","長崎県","壱岐市",22,0.22,2,"",2]
["市区町村","422118","長崎県","五島市",24,0.24,2,"",2]
["市区町村","422126","長崎県","西海市",29,0.28999999999999998,2,"",2]
["市区町村","422134","長崎県","雲仙市",28,0.28000000000000003,2,"",2]
["市区町村","422142","長崎県","南島原市",25,0.25,2,"",2]
["市区町村","423076","長崎県","長与町",61,0.61,2,"",2]
["市区町村","423084","長崎県","時津町",66,0.66,2,"",2]
["市区町村","423211","長崎県","東彼杵町",31,0.31,2,"",2]
["市区町村","423220","長崎県","川棚町",36,0.36,2,"",2]
["市区町村","423238","長崎県","波佐見町",40,0.4,2,"",2]
["市区町村","423831","長崎県","小値賀町",10,0.1,2,"",2]
["市区町村","423912","長崎県","佐々町",48,0.48,2,"",2]
["市区町村","424111","長崎県","新上五島町",22,0.22,2,"",2]
["市区町村","431001","熊本県","熊本市",68,0.68,2,"",2]
["市区町村","432024","熊本県","八代市",50,0.5,2,"",2]
["市区町村","432032","熊本県","人吉市",44,0.44,2,"",2]
["市区町村","432041","熊本県","荒尾市",48,0.48,2,"",2]
["市区町村","432059","熊本県","水俣市",38,0.38,2,"",2]
["市区町村","432067","熊本県","玉名市",44,0.44,2,"",2]
["市区町村","432083","熊本県","山鹿市",34,0.34,2,"",2]
["市区町村","432105","熊本県","菊池市",45,0.45,2,"",2]
["市区町村","432113","熊本県","宇土市",49,0.49,2,"",2]
["市区町村","432121","熊本県","上天草市",26,0.26,2,"",2]
["市区町村","432130","熊本県","宇城市",40,0.4,2,"",2]
["市区町村","432148","熊本県","阿蘇市",35,0.35,2,"",2]
["市区町村","432156","熊本県","天草市",28,0.28000000000000003,2,"",2]
["市区町村","432164","熊本県","合志市",63,0.63,2,"",2]
["市区町村","433489","熊本県","美里町",22,0.22,2,"",2]
["市区町村","433641","熊本県","玉東町",30,0.3,2,"",2]
["市区町村","433675","熊本県","南関町",39,0.39,2,"",2]
["市区町村","433683","熊本県","長洲町",50,0.5,2,"",2]
["市区町村","433691","熊本県","和水町",26,0.26,2,"",2]
["市区町村","434035","熊本県","大津町",73,0.73,2,"",2]
["市区町村","434043","熊本県","菊陽町",95,0.95,2,"",2]
["市区町村","434230","熊本県","南小国町",20,0.2,2,"",2]
["市区町村","434248","熊本県","小国町",25,0.25,2,"",2]
["市区町村","434256","熊本県","産山村",15,0.15,2,"",2]
["市区町村","434281","熊本県","高森町",27,0.27,2,"",2]
["市区町村","434329","熊本県","西原村",36,0.36,2,"",2]
["市区町村","434337","熊本県","南阿蘇村",21,0.21,2,"",2]
["市区町村","434418","熊本県","御船町",36,0.36,2,"",2]
["市区町村","434426","熊本県","嘉島町",60,0.6,2,"",2]
["市区町村","434434","熊本県","益城町",49,0.49,2,"",2]
["市区町村","434442","熊本県","甲佐町",30,0.3,2,"",2]
["市区町村","434477","熊本県","山都町",24,0.24,2,"",2]
["市区町村","434680","熊本県","氷川町",28,0.28000000000000003,2,"",2]
["市区町村","434825","熊本県","芦北町",36,0.36,2,"",2]
["市区町村","434841","熊本県","津奈木町",24,0.24,2,"",2]
["市区町村","435015","熊本県","錦町",40,{"$f":"IF(A1652=\"都道府県\",E1652/100000,IF(A1652=\"市区町村\",E1652/100,\"エラー\"))","v":0.4},2,"",2]
["市区町村","435058","熊本県","多良木町",23,0.23,2,"",2]
["市区町村","435066","熊本県","湯前町",17,0.17,2,"",2]
["市区町村","435074","熊本県","水上村",17,0.17,2,"",2]
["市区町村","435104","熊本県","相良村",20,0.2,2,"",2]
["市区町村","435112","熊本県","五木村",21,0.21,2,"",2]
["市区町村","435121","熊本県","山江村",16,0.16,2,"",2]
["市区町村","435139","熊本県","球磨村",15,0.15,2,"",2]
["市区町村","435147","熊本県","あさぎり町",24,0.24,2,"",2]
["市区町村","435317","熊本県","苓北町",40,0.4,2,"",2]
["市区町村","442011","大分県","大分市",86,0.86,2,"",2]
["市区町村","442020","大分県","別府市",56,0.56000000000000005,2,"",2]
["市区町村","442038","大分県","中津市",52,0.52,2,"",2]
["市区町村","442046","大分県","日田市",43,0.43,2,"",2]
["市区町村","442054","大分県","佐伯市",35,0.35,2,{"$f":"IF(_xlfn.IFNA(VLOOKUP(B1666,$T:$T,1,0),\"\")=\"\",\"\",\"〇\")","v":""},2]
["市区町村","442062","大分県","臼杵市",37,0.37,{"$f":"IF(F1667<>\"エラー\",IF(F1667>=$N$16, 1, IF(F1667<=$N$18, 3, 2)),\"エラー\")","v":2},"",{"$f":"IF(H1667=\"〇\",1,G1667)","v":2}]
["市区町村","442071","大分県","津久見市",39,0.39,2,"",2]
["市区町村","442089","大分県","竹田市",26,0.26,2,"",2]
["市区町村","442097","大分県","豊後高田市",32,0.32,2,"",2]
["市区町村","442101","大分県","杵築市",34,0.34,2,"",2]
["市区町村","442119","大分県","宇佐市",42,0.42,2,"",2]
["市区町村","442127","大分県","豊後大野市",29,0.28999999999999998,2,"",2]
["市区町村","442135","大分県","由布市",42,0.42,2,"",2]
["市区町村","442143","大分県","国東市",31,0.31,2,"",2]
["市区町村","443221","大分県","姫島村",10,0.1,2,"",2]
["市区町村","443417","大分県","日出町",58,0.57999999999999996,2,"",2]
["市区町村","444618","大分県","九重町",32,0.32,2,"",2]
["市区町村","444626","大分県","玖珠町",37,0.37,2,"",2]
["市区町村","452017","宮崎県","宮崎市",69,0.69,2,"",2]
["市区町村","452025","宮崎県","都城市",55,0.55000000000000004,2,"",2]
["市区町村","452033","宮崎県","延岡市",53,0.53,2,"",2]
["市区町村","452041","宮崎県","日南市",40,0.4,2,"",2]
["市区町村","452050","宮崎県","小林市",39,0.39,2,"",2]
["市区町村","452068","宮崎県","日向市",56,0.56000000000000005,2,"",2]
["市区町村","452076","宮崎県","串間市",32,0.32,2,"",2]
["市区町村","452084","宮崎県","西都市",39,0.39,2,"",2]
["市区町村","452092","宮崎県","えびの市",36,0.36,2,"",2]
["市区町村","453412","宮崎県","三股町",45,0.45,2,"",2]
["市区町村","453617","宮崎県","高原町",27,0.27,2,"",2]
["市区町村","453820","宮崎県","国富町",45,0.45,2,"",2]
["市区町村","453838","宮崎県","綾町",27,0.27,2,"",2]
["市区町村","454010","宮崎県","高鍋町",53,0.53,2,"",2]
["市区町村","454028","宮崎県","新富町",45,0.45,2,"",2]
["市区町村","454036","宮崎県","西米良村",14,0.14000000000000001,2,"",2]
["市区町村","454044","宮崎県","木城町",75,0.75,2,"",2]
["市区町村","454052","宮崎県","川南町",45,0.45,2,"",2]
["市区町村","454061","宮崎県","都農町",30,0.3,2,"",2]
["市区町村","454214","宮崎県","門川町",42,0.42,2,"",2]
["市区町村","454290","宮崎県","諸塚村",27,0.27,2,"",2]
["市区町村","454303","宮崎県","椎葉村",18,0.18,2,"",2]
["市区町村","454311","宮崎県","美郷町",19,0.19,2,"",2]
["市区町村","454419","宮崎県","高千穂町",25,0.25,2,"",2]
["市区町村","454427","宮崎県","日之影町",17,0.17,2,"",2]
["市区町村","454435","宮崎県","五ケ瀬町",15,0.15,2,"",2]
["市区町村","462012","鹿児島県","鹿児島市",69,0.69,2,"",2]
["市区町村","462039","鹿児島県","鹿屋市",47,0.47,2,"",2]
["市区町村","462047","鹿児島県","枕崎市",39,0.39,2,"",2]
["市区町村","462063","鹿児島県","阿久根市",35,0.35,2,"",2]
["市区町村","462080","鹿児島県","出水市",43,0.43,2,"",2]
["市区町村","462101","鹿児島県","指宿市",36,0.36,2,"",2]
["市区町村","462136","鹿児島県","西之表市",29,0.28999999999999998,2,"",2]
["市区町村","462144","鹿児島県","垂水市",29,0.28999999999999998,2,"",2]
["市区町村","462152","鹿児島県","薩摩川内市",59,0.59,2,"",2]
["市区町村","462161","鹿児島県","日置市",40,0.4,2,"",2]
["市区町村","462179","鹿児島県","曽於市",31,{"$f":"IF(A1716=\"都道府県\",E1716/100000,IF(A1716=\"市区町村\",E1716/100,\"エラー\"))","v":0.31},2,"",2]
["市区町村","462187","鹿児島県","霧島市",55,0.55000000000000004,2,"",2]
["市区町村","462195","鹿児島県","いちき串木野市",39,0.39,2,"",2]
["市区町村","462209","鹿児島県","南さつま市",29,0.28999999999999998,2,"",2]
["市区町村","462217","鹿児島県","志布志市",39,0.39,2,"",2]
["市区町村","462225","鹿児島県","奄美市",27,0.27,2,"",2]
["市区町村","462233","鹿児島県","南九州市",36,0.36,2,"",2]
["市区町村","462241","鹿児島県","伊佐市",38,0.38,2,"",2]
["市区町村","462250","鹿児島県","姶良市",51,0.51,2,"",2]
["市区町村","463035","鹿児島県","三島村",6,0.06,2,"",2]
["市区町村","463043","鹿児島県","十島村",7,7.0000000000000007E-2,2,"",2]
["市区町村","463922","鹿児島県","さつま町",38,0.38,2,"",2]
["市区町村","464040","鹿児島県","長島町",19,0.19,2,"",2]
["市区町村","464520","鹿児島県","湧水町",30,0.3,2,"",2]
["市区町村","464686","鹿児島県","大崎町",35,0.35,2,{"$f":"IF(_xlfn.IFNA(VLOOKUP(B1730,$T:$T,1,0),\"\")=\"\",\"\",\"〇\")","v":""},2]
["市区町村","464821","鹿児島県","東串良町",28,0.28000000000000003,{"$f":"IF(F1731<>\"エラー\",IF(F1731>=$N$16, 1, IF(F1731<=$N$18, 3, 2)),\"エラー\")","v":2},"",{"$f":"IF(H1731=\"〇\",1,G1731)","v":2}]
["市区町村","464902","鹿児島県","錦江町",19,0.19,2,"",2]
["市区町村","464911","鹿児島県","南大隅町",16,0.16,2,"",2]
["市区町村","464929","鹿児島県","肝付町",28,0.28000000000000003,2,"",2]
["市区町村","465011","鹿児島県","中種子町",22,0.22,2,"",2]
["市区町村","465020","鹿児島県","南種子町",24,0.24,2,"",2]
["市区町村","465054","鹿児島県","屋久島町",23,0.23,2,"",2]
["市区町村","465232","鹿児島県","大和村",8,0.08,2,"",2]
["市区町村","465241","鹿児島県","宇検村",9,0.09,2,"",2]
["市区町村","465259","鹿児島県","瀬戸内町",16,0.16,2,"",2]
["市区町村","465275","鹿児島県","龍郷町",17,0.17,2,"",2]
["市区町村","465291","鹿児島県","喜界町",16,0.16,2,"",2]
["市区町村","465305","鹿児島県","徳之島町",23,0.23,2,"",2]
["市区町村","465313","鹿児島県","天城町",15,0.15,2,"",2]
["市区町村","465321","鹿児島県","伊仙町",13,0.13,2,"",2]
["市区町村","465330","鹿児島県","和泊町",18,0.18,2,"",2]
["市区町村","465348","鹿児島県","知名町",15,0.15,2,"",2]
["市区町村","465356","鹿児島県","与論町",16,0.16,2,"",2]
["市区町村","472018","沖縄県","那覇市",84,0.84,2,"",2]
["市区町村","472051","沖縄県","宜野湾市",67,0.67,2,"",2]
["市区町村","472077","沖縄県","石垣市",46,0.46,2,"",2]
["市区町村","472085","沖縄県","浦添市",75,0.75,2,"",2]
["市区町村","472093","沖縄県","名護市",45,0.45,2,"",2]
["市区町村","472107","沖縄県","糸満市",54,0.54,2,"",2]
["市区町村","472115","沖縄県","沖縄市",58,0.57999999999999996,2,"",2]
["市区町村","472123","沖縄県","豊見城市",63,0.63,2,"",2]
["市区町村","472131","沖縄県","うるま市",49,0.49,2,"",2]
["市区町村","472140","沖縄県","宮古島市",39,0.39,2,"",2]
["市区町村","472158","沖縄県","南城市",38,0.38,2,"",2]
["市区町村","473014","沖縄県","国頭村",20,0.2,2,"",2]
["市区町村","473022","沖縄県","大宜味村",39,0.39,2,"",2]
["市区町村","473031","沖縄県","東村",13,0.13,2,"",2]
["市区町村","473065","沖縄県","今帰仁村",27,0.27,2,"",2]
["市区町村","473081","沖縄県","本部町",35,0.35,2,"",2]
["市区町村","473111","沖縄県","恩納村",63,0.63,2,"",2]
["市区町村","473138","沖縄県","宜野座村",29,0.28999999999999998,2,"",2]
["市区町村","473146","沖縄県","金武町",39,{"$f":"IF(A1767=\"都道府県\",E1767/100000,IF(A1767=\"市区町村\",E1767/100,\"エラー\"))","v":0.39},2,{"$f":"IF(_xlfn.IFNA(VLOOKUP(B1767,$T:$T,1,0),\"\")=\"\",\"\",\"〇\")","v":""},{"$f":"IF(H1767=\"〇\",1,G1767)","v":2}]
["市区町村","473154","沖縄県","伊江村",15,0.15,2,"",2]
["市区町村","473243","沖縄県","読谷村",63,0.63,2,"",2]
["市区町村","473251","沖縄県","嘉手納町",61,0.61,2,"",2]
["市区町村","473260","沖縄県","北谷町",80,0.8,2,"",2]
["市区町村","473278","沖縄県","北中城村",63,0.63,2,"",2]
["市区町村","473286","沖縄県","中城村",61,0.61,2,"",2]
["市区町村","473294","沖縄県","西原町",62,0.62,2,"",2]
["市区町村","473481","沖縄県","与那原町",47,0.47,2,"",2]
["市区町村","473502","沖縄県","南風原町",62,0.62,2,"",2]
["市区町村","473537","沖縄県","渡嘉敷村",10,0.1,2,"",2]
["市区町村","473545","沖縄県","座間味村",10,0.1,2,"",2]
["市区町村","473553","沖縄県","粟国村",9,0.09,2,"",2]
["市区町村","473561","沖縄県","渡名喜村",7,7.0000000000000007E-2,2,"",2]
["市区町村","473570","沖縄県","南大東村",15,0.15,2,"",2]
["市区町村","473588","沖縄県","北大東村",9,0.09,2,"",2]
["市区町村","473596","沖縄県","伊平屋村",8,0.08,2,"",2]
["市区町村","473600","沖縄県","伊是名村",10,0.1,2,"",2]
["市区町村","473618","沖縄県","久米島町",19,0.19,2,"",2]
["市区町村","473626","沖縄県","八重瀬町",44,0.44,2,"",2]
["市区町村","473758","沖縄県","多良間村",11,0.11,2,"",2]
["市区町村","473812","沖縄県","竹富町",14,0.14000000000000001,2,"",2]
["市区町村","473821","沖縄県","与那国町",14,0.14000000000000001,2,"",2]